program: Orca
programVersion: 5.0.2
elementType: O O C C C C C C C C C C C C C C C C C H H H H H H H H H H H H H H H H H H H H H H H H H H H H H H
charge: 0
multiplicity: 1
keywords: wb97x-d3
keywords: def2-TZVPP
keywords: def2/J RIJCOSX
keywords: DEFGRID2
keywords: scfconv7
keywords: smallprint printgap noloewdin
keywords: NOSOSCF
formula: C17H30O2
InChI: InChI=1/C17H30O2/c1-6-19-17(18)13-16(5)12-8-11-15(4)10-7-9-14(2)3/h8,12-15H,6-7,9-11H2,1-5H3
49 atoms
O  3.540738 -0.582129 1.194232
O  3.25997 -1.039095 -0.97763
C  -4.213381 -0.334989 0.158704
C  -3.423732 0.908312 0.590108
C  -2.49638 1.48257 -0.480174
C  -1.444853 2.412791 0.1097
C  -0.536117 3.10119 -0.908989
C  -3.439104 -1.63151 0.470205
C  -5.574372 -0.39115 0.842014
C  0.397303 4.081108 -0.206463
C  0.271954 2.102094 -1.730905
C  -2.109747 -1.702074 -0.196001
C  -0.940288 -1.568083 0.439688
C  0.361895 -1.498733 -0.216025
C  0.410172 -1.767801 -1.686104
C  1.412829 -1.149882 0.55977
C  2.798555 -0.937118 0.141421
C  4.942387 -0.343315 1.004153
C  5.743836 -1.62509 1.007224
H  -4.378979 -0.286911 -0.924117
H  -2.842224 0.663227 1.487088
H  -4.11932 1.693961 0.900702
H  -3.094578 2.019785 -1.223874
H  -2.005649 0.672166 -1.022006
H  -1.945027 3.180185 0.711491
H  -0.821189 1.842135 0.809845
H  -1.171894 3.670867 -1.597551
H  -4.046667 -2.482633 0.146338
H  -3.319855 -1.71407 1.554715
H  -5.466948 -0.412642 1.929176
H  -6.178629 0.481327 0.588832
H  -6.135994 -1.280064 0.548681
H  1.058473 3.558854 0.489769
H  -0.158879 4.826379 0.365499
H  1.028228 4.615514 -0.919092
H  -0.363638 1.439966 -2.320018
H  0.936657 2.615055 -2.428714
H  0.894856 1.475976 -1.085496
H  -2.127529 -1.81873 -1.275661
H  -0.944305 -1.430663 1.517404
H  1.417142 -1.847074 -2.075105
H  -0.099303 -0.968625 -2.229568
H  -0.119695 -2.691874 -1.919238
H  1.224376 -0.982429 1.613966
H  5.229101 0.28536 1.845581
H  5.111297 0.22886 0.09102
H  6.804696 -1.380326 0.947327
H  5.584993 -2.189892 1.925981
H  5.503687 -2.266179 0.159737
elementType: O C H
totalener: -816.41256059 hartree
nucrepener: 1492.04169054 hartree
electener: -2308.45425113 hartree
oneelecener: -4069.66827018 hartree
twoeener: 1761.21401905 hartree
cpcmener: -0.02046098 hartree
kineticenergy: 812.45698533 hartree
xcener: -82.316476812077 hartree
chargesum: 0.0000000
charge: -0.300212 -0.519989 0.080052 -0.191789 -0.122786 -0.188055 0.108882 -0.131347 -0.312940 -0.301900 -0.319402 -0.077494 -0.197123 0.006416 -0.269144 -0.191717 0.509485 0.039516 -0.255501 0.048830 0.069564 0.083514 0.080568 0.064722 0.079702 0.060051 0.025341 0.090474 0.080499 0.087564 0.089509 0.089895 0.082104 0.088096 0.090342 0.096162 0.101257 0.062549 0.132651 0.118068 0.111016 0.106915 0.113862 0.114893 0.109120 0.087229 0.095753 0.087922 0.086877
qa: -0.3002 -0.5200 0.0801 -0.1918 -0.1228 -0.1881 0.1089 -0.1313 -0.3129 -0.3019 -0.3194 -0.0775 -0.1971 0.0064 -0.2691 -0.1917 0.5095 0.0395 -0.2555 0.0488 0.0696 0.0835 0.0806 0.0647 0.0797 0.0601 0.0253 0.0905 0.0805 0.0876 0.0895 0.0899 0.0821 0.0881 0.0903 0.0962 0.1013 0.0625 0.1327 0.1181 0.1110 0.1069 0.1139 0.1149 0.1091 0.0872 0.0958 0.0879 0.0869
va: 2.1149 1.9681 3.7448 3.8931 3.8382 3.8898 3.7858 3.9401 3.9456 3.9336 3.9413 3.8251 3.8994 3.6533 3.9078 3.7583 4.1115 3.8471 3.9171 1.0209 1.0094 1.0066 1.0135 1.0080 1.0117 1.0111 1.0194 1.0081 1.0122 0.9996 1.0036 1.0043 1.0015 1.0051 1.0052 0.9964 1.0083 1.0082 0.9981 1.0213 1.0333 0.9949 0.9992 1.0346 0.9955 1.0125 1.0070 1.0044 1.0136
dispcorr: -0.023186153 hartree
energy: -816.435746739298
dipole: -13.54547 12.42433 -1.12114 10.85084 -10.77081 0.08003 -1.38776 1.95399 0.56622
magnitude: 1.25856 au
magnitude: 3.19901 debye
