program: Orca
programVersion: 5.0.2
elementType: O O C C C C C C C C C C C C C C C C C H H H H H H H H H H H H H H H H H H H H H H H H H H H H H H
charge: 0
multiplicity: 1
keywords: wb97x-d3
keywords: def2-TZVPP
keywords: def2/J RIJCOSX
keywords: DEFGRID2
keywords: scfconv7
keywords: smallprint printgap noloewdin
keywords: NOSOSCF
formula: C17H30O2
InChI: InChI=1/C17H30O2/c1-6-19-17(18)13-16(5)12-8-11-15(4)10-7-9-14(2)3/h8,12-15H,6-7,9-11H2,1-5H3
49 atoms
O  4.280038 -3.166439 1.744758
O  4.594538 -1.896601 -0.069443
C  -2.868412 0.146134 0.360024
C  -2.695614 1.287373 -0.643875
C  -3.521861 2.529569 -0.330479
C  -3.327458 3.628429 -1.368376
C  -4.081049 4.928065 -1.082569
C  -2.276724 -1.173774 -0.17103
C  -2.290078 0.489066 1.72782
C  -3.687039 6.000734 -2.091868
C  -5.59276 4.7298 -1.08647
C  -0.820277 -1.092574 -0.47926
C  0.133513 -1.717765 0.219822
C  1.566643 -1.634678 -0.052362
C  1.998161 -0.78618 -1.205472
C  2.381371 -2.327635 0.774033
C  3.842578 -2.412522 0.732548
C  5.690933 -3.38591 1.887709
C  6.200704 -4.480365 0.978097
H  -3.943036 -0.031461 0.48204
H  -2.970838 0.928274 -1.642036
H  -1.637467 1.566007 -0.70332
H  -3.254409 2.92179 0.6557
H  -4.577153 2.246424 -0.270796
H  -2.257634 3.853008 -1.441534
H  -3.625055 3.255439 -2.355945
H  -3.785769 5.276312 -0.085386
H  -2.814517 -1.447503 -1.084611
H  -2.459777 -1.967076 0.558232
H  -2.399257 -0.345482 2.423276
H  -1.226019 0.727025 1.663931
H  -2.79113 1.348282 2.174738
H  -2.611695 6.188474 -2.07902
H  -4.189525 6.947813 -1.886267
H  -3.956302 5.700459 -3.107672
H  -6.113881 5.670907 -0.900734
H  -5.932635 4.350898 -2.053937
H  -5.921609 4.024005 -0.322932
H  -0.543714 -0.470638 -1.324774
H  -0.159088 -2.338292 1.062423
H  3.070857 -0.766273 -1.347992
H  1.653641 0.239729 -1.063876
H  1.53824 -1.144355 -2.127968
H  1.918241 -2.894109 1.573831
H  5.81666 -3.672293 2.930637
H  6.237561 -2.454531 1.733407
H  7.253385 -4.660322 1.198174
H  5.66377 -5.414666 1.142826
H  6.123339 -4.216119 -0.075643
elementType: O C H
totalener: -816.41470103 hartree
nucrepener: 1366.67675114 hartree
electener: -2183.09145216 hartree
oneelecener: -3818.70476364 hartree
twoeener: 1635.61331148 hartree
cpcmener: -0.02013631 hartree
kineticenergy: 812.45244884 hartree
xcener: -82.314811365777 hartree
chargesum: -0.0000000
charge: -0.299171 -0.515353 0.140844 -0.200358 -0.123936 -0.158225 0.075683 -0.141045 -0.343638 -0.298753 -0.306062 -0.133553 -0.163642 0.021552 -0.262148 -0.179328 0.488097 0.039794 -0.255044 0.041705 0.077204 0.070076 0.066243 0.065818 0.068953 0.065780 0.026157 0.096218 0.087568 0.096858 0.084569 0.098402 0.088155 0.090268 0.080233 0.091136 0.081850 0.090287 0.129390 0.115390 0.107316 0.105488 0.106854 0.116393 0.108642 0.086543 0.095866 0.087725 0.087199
qa: -0.2992 -0.5154 0.1408 -0.2004 -0.1239 -0.1582 0.0757 -0.1410 -0.3436 -0.2988 -0.3061 -0.1336 -0.1636 0.0216 -0.2621 -0.1793 0.4881 0.0398 -0.2550 0.0417 0.0772 0.0701 0.0662 0.0658 0.0690 0.0658 0.0262 0.0962 0.0876 0.0969 0.0846 0.0984 0.0882 0.0903 0.0802 0.0911 0.0818 0.0903 0.1294 0.1154 0.1073 0.1055 0.1069 0.1164 0.1086 0.0865 0.0959 0.0877 0.0872
va: 2.1132 1.9796 3.7331 3.9442 3.8768 3.8834 3.8175 3.9397 3.9608 3.9300 3.9278 3.8571 3.8950 3.6955 3.9215 3.7717 4.1450 3.8486 3.9150 1.0177 1.0090 1.0047 1.0100 1.0106 1.0118 1.0122 1.0184 1.0060 1.0132 1.0036 0.9976 1.0040 1.0048 1.0047 1.0032 1.0043 1.0026 1.0026 0.9972 1.0230 1.0355 0.9964 0.9959 1.0332 0.9958 1.0122 1.0069 1.0043 1.0143
dispcorr: -0.019000936 hartree
energy: -816.433701963101
dipole: -26.20770 25.00280 -1.20489 21.96326 -22.07071 -0.10745 -5.70146 6.08931 0.38784
magnitude: 1.27033 au
magnitude: 3.22892 debye
