program: Orca
programVersion: 5.0.2
elementType: O O C C C C C C C C C C C C C C C C C H H H H H H H H H H H H H H H H H H H H H H H H H H H H H H
charge: 0
multiplicity: 1
keywords: wb97x-d3
keywords: def2-TZVPP
keywords: def2/J RIJCOSX
keywords: DEFGRID2
keywords: scfconv7
keywords: smallprint printgap noloewdin
keywords: NOSOSCF
formula: C17H30O2
InChI: InChI=1/C17H30O2/c1-6-19-17(18)13-16(5)12-8-11-15(4)10-7-9-14(2)3/h8,12-15H,6-7,9-11H2,1-5H3
49 atoms
O  4.286894 -3.29474 1.707388
O  4.652844 -1.806385 0.078274
C  -2.84635 0.1618 0.322006
C  -2.686805 1.328054 -0.655341
C  -3.567535 2.532052 -0.341408
C  -3.387543 3.659703 -1.350417
C  -4.217935 4.913487 -1.071618
C  -2.211073 -1.130654 -0.224218
C  -2.302964 0.492445 1.707058
C  -3.833393 6.030174 -2.035923
C  -5.715558 4.639278 -1.154195
C  -0.745969 -1.016335 -0.474007
C  0.187001 -1.689458 0.208244
C  1.627921 -1.58253 -0.006755
C  2.095631 -0.644862 -1.073385
C  2.416598 -2.342837 0.785181
C  3.878317 -2.422256 0.782268
C  5.692877 -3.536379 1.860028
C  6.211892 -4.538211 0.854234
H  -3.917973 -0.046321 0.41949
H  -2.922511 0.979376 -1.667156
H  -1.638237 1.645387 -0.680764
H  -3.34434 2.912722 0.660192
H  -4.612215 2.20724 -0.319105
H  -2.328422 3.938878 -1.375417
H  -3.626125 3.292882 -2.356146
H  -3.987915 5.250625 -0.05364
H  -2.709592 -1.385387 -1.165417
H  -2.406611 -1.949705 0.472675
H  -2.833101 1.331221 2.159354
H  -2.405207 -0.35718 2.385121
H  -1.243887 0.756813 1.668091
H  -2.771007 6.271873 -1.967663
H  -4.393057 6.945048 -1.83215
H  -4.03982 5.742839 -3.070004
H  -6.044005 3.89777 -0.425183
H  -6.292946 5.547657 -0.972243
H  -5.987807 4.269318 -2.14623
H  -0.445853 -0.331801 -1.261149
H  -0.130627 -2.373217 0.990684
H  1.661769 -0.924239 -2.034957
H  3.172049 -0.61948 -1.182589
H  1.750353 0.368055 -0.859212
H  1.929242 -2.977947 1.51598
H  5.794462 -3.927335 2.871159
H  6.248305 -2.598978 1.810784
H  5.672044 -5.482933 0.921028
H  6.145127 -4.171588 -0.169314
H  7.262001 -4.741026 1.066368
elementType: O C H
totalener: -816.41481144 hartree
nucrepener: 1364.73313137 hartree
electener: -2181.14794281 hartree
oneelecener: -3814.81363431 hartree
twoeener: 1633.66569150 hartree
cpcmener: -0.02021092 hartree
kineticenergy: 812.45622906 hartree
xcener: -82.315454275032 hartree
chargesum: -0.0000000
charge: -0.299037 -0.515979 0.138314 -0.199375 -0.123239 -0.158578 0.075050 -0.138635 -0.342441 -0.298527 -0.306094 -0.136689 -0.160431 0.021224 -0.263238 -0.181111 0.489059 0.040272 -0.254768 0.041774 0.077257 0.068707 0.065927 0.065274 0.068934 0.065833 0.026566 0.096007 0.087577 0.098234 0.097066 0.084403 0.088170 0.090014 0.080439 0.090430 0.090852 0.082173 0.130515 0.115032 0.106934 0.107733 0.106183 0.116761 0.108436 0.086600 0.088194 0.086884 0.095313
qa: -0.2990 -0.5160 0.1383 -0.1994 -0.1232 -0.1586 0.0750 -0.1386 -0.3424 -0.2985 -0.3061 -0.1367 -0.1604 0.0212 -0.2632 -0.1811 0.4891 0.0403 -0.2548 0.0418 0.0773 0.0687 0.0659 0.0653 0.0689 0.0658 0.0266 0.0960 0.0876 0.0982 0.0971 0.0844 0.0882 0.0900 0.0804 0.0904 0.0909 0.0822 0.1305 0.1150 0.1069 0.1077 0.1062 0.1168 0.1084 0.0866 0.0882 0.0869 0.0953
va: 2.1139 1.9783 3.7331 3.9450 3.8766 3.8844 3.8170 3.9360 3.9596 3.9297 3.9274 3.8609 3.8981 3.6968 3.9205 3.7729 4.1448 3.8470 3.9171 1.0174 1.0091 1.0054 1.0103 1.0109 1.0118 1.0121 1.0183 1.0058 1.0131 1.0039 1.0035 0.9978 1.0048 1.0048 1.0031 1.0027 1.0043 1.0026 0.9973 1.0232 0.9955 1.0355 0.9963 1.0329 0.9958 1.0128 1.0041 1.0138 1.0071
dispcorr: -0.018950072 hartree
energy: -816.433761511880
dipole: -26.70219 25.48146 -1.22074 21.90809 -22.09363 -0.18555 -6.10804 6.39765 0.28961
magnitude: 1.26827 au
magnitude: 3.22368 debye
