program: Orca
programVersion: 5.0.2
elementType: O O C C C C C C C C C C C C C C C C C H H H H H H H H H H H H H H H H H H H H H H H H H H H H H H
charge: 0
multiplicity: 1
keywords: wb97x-d3
keywords: def2-TZVPP
keywords: def2/J RIJCOSX
keywords: DEFGRID2
keywords: scfconv7
keywords: smallprint printgap noloewdin
keywords: NOSOSCF
formula: C17H30O2
InChI: InChI=1/C17H30O2/c1-6-19-17(18)13-16(5)12-8-11-15(4)10-7-9-14(2)3/h8,12-15H,6-7,9-11H2,1-5H3
49 atoms
O  5.253503 -2.684483 0.335598
O  3.812699 -4.04115 1.368212
C  -1.94054 0.961744 -0.254072
C  -2.858059 1.872453 -1.07004
C  -3.831347 2.698577 -0.237205
C  -4.819887 3.474685 -1.098983
C  -5.88228 4.25064 -0.319215
C  -1.130107 0.056387 -1.194488
C  -1.016579 1.749329 0.666821
C  -5.274803 5.348797 0.546038
C  -6.91388 4.839864 -1.274661
C  -0.382797 -1.007496 -0.468322
C  0.946531 -1.150885 -0.490498
C  1.695755 -2.18169 0.223276
C  0.917036 -3.147447 1.057514
C  3.038254 -2.165296 0.071312
C  4.020991 -3.070232 0.6685
C  6.362541 -3.437749 0.846787
C  7.626569 -2.816087 0.309556
H  -2.575237 0.314728 0.364252
H  -3.431435 1.253058 -1.768227
H  -2.246915 2.540067 -1.688962
H  -3.277611 3.387789 0.404966
H  -4.385009 2.033106 0.435074
H  -4.273361 4.171786 -1.74583
H  -5.323898 2.772132 -1.771901
H  -6.397655 3.542161 0.340683
H  -0.444163 0.66333 -1.793289
H  -1.824429 -0.42388 -1.893112
H  -0.376126 2.422855 0.091235
H  -1.573035 2.354698 1.382767
H  -0.365417 1.09018 1.242996
H  -6.049411 5.905396 1.076938
H  -4.718536 6.063512 -0.066256
H  -4.589314 4.954588 1.297077
H  -7.390013 4.064743 -1.878192
H  -7.701885 5.369401 -0.735942
H  -6.449584 5.552451 -1.961027
H  -0.992387 -1.690333 0.117051
H  1.535601 -0.452925 -1.078937
H  0.203892 -3.691943 0.436177
H  0.331374 -2.607965 1.803779
H  1.537664 -3.869996 1.571591
H  3.46079 -1.392292 -0.560259
H  6.279816 -4.480065 0.532229
H  6.352306 -3.413425 1.938642
H  7.734331 -1.779237 0.628448
H  8.484618 -3.370584 0.688778
H  7.662666 -2.851814 -0.779265
elementType: O C H
totalener: -816.41708078 hartree
nucrepener: 1336.42239698 hartree
electener: -2152.83947776 hartree
oneelecener: -3758.10112520 hartree
twoeener: 1605.26164744 hartree
cpcmener: -0.02080231 hartree
kineticenergy: 812.46231762 hartree
xcener: -82.314706990302 hartree
chargesum: -0.0000000
charge: -0.290975 -0.515130 0.111224 -0.176028 -0.120344 -0.162151 0.075503 -0.104416 -0.341086 -0.305504 -0.299555 -0.153297 -0.147643 0.013820 -0.261676 -0.169900 0.480491 0.039418 -0.253963 0.040486 0.070333 0.069468 0.070594 0.061934 0.065798 0.069017 0.026252 0.079454 0.094129 0.085466 0.096843 0.096866 0.091300 0.082142 0.089306 0.088114 0.089879 0.080878 0.125836 0.115306 0.107284 0.105610 0.106239 0.116215 0.094854 0.096677 0.088208 0.088801 0.087925
qa: -0.2910 -0.5151 0.1112 -0.1760 -0.1203 -0.1622 0.0755 -0.1044 -0.3411 -0.3055 -0.2996 -0.1533 -0.1476 0.0138 -0.2617 -0.1699 0.4805 0.0394 -0.2540 0.0405 0.0703 0.0695 0.0706 0.0619 0.0658 0.0690 0.0263 0.0795 0.0941 0.0855 0.0968 0.0969 0.0913 0.0821 0.0893 0.0881 0.0899 0.0809 0.1258 0.1153 0.1073 0.1056 0.1062 0.1162 0.0949 0.0967 0.0882 0.0888 0.0879
va: 2.1154 1.9847 3.7461 3.9119 3.8734 3.8922 3.8120 3.9198 3.9527 3.9287 3.9308 3.8887 3.9181 3.7020 3.9223 3.7755 4.1390 3.8451 3.9712 1.0232 1.0131 1.0097 1.0051 1.0101 1.0110 1.0121 1.0183 1.0167 1.0060 1.0023 1.0021 1.0025 1.0044 1.0025 1.0024 1.0048 1.0048 1.0030 1.0043 1.0232 0.9960 0.9959 1.0355 1.0323 0.9965 0.9954 1.0031 1.0066 1.0033
dispcorr: -0.018190415 hartree
energy: -816.435271196104
dipole: -28.82597 28.26998 -0.55599 26.95167 -25.98720 0.96447 -3.09588 2.56212 -0.53376
magnitude: 1.23459 au
magnitude: 3.13809 debye
