program: Orca
programVersion: 5.0.2
elementType: O O C C C C C C C C C C C C C C C C C H H H H H H H H H H H H H H H H H H H H H H H H H H H H H H
charge: 0
multiplicity: 1
keywords: wb97x-d3
keywords: def2-TZVPP
keywords: def2/J RIJCOSX
keywords: DEFGRID2
keywords: scfconv7
keywords: smallprint printgap noloewdin
keywords: NOSOSCF
formula: C17H30O2
InChI: InChI=1/C17H30O2/c1-6-19-17(18)13-16(5)12-8-11-15(4)10-7-9-14(2)3/h8,12-15H,6-7,9-11H2,1-5H3
49 atoms
O  4.148793 -1.549109 1.185371
O  3.619321 -2.848953 -0.555264
C  -3.826335 -0.435316 -0.358868
C  -3.108319 0.722725 -1.058068
C  -2.69744 1.88325 -0.159023
C  -2.005753 2.995163 -0.938714
C  -1.545011 4.18336 -0.092487
C  -2.948997 -1.125788 0.695729
C  -5.153035 -0.008814 0.258589
C  -0.692479 5.130691 -0.928173
C  -2.7175 4.936743 0.527163
C  -1.693581 -1.684709 0.122576
C  -0.462104 -1.412821 0.568854
C  0.769767 -1.982133 0.027846
C  0.646097 -2.884117 -1.158301
C  1.920784 -1.644942 0.651528
C  3.277076 -2.092311 0.330754
C  5.545151 -1.836521 1.022476
C  6.188075 -0.962655 -0.030418
H  -4.047324 -1.181625 -1.130775
H  -3.762399 1.103602 -1.849586
H  -2.219451 0.336806 -1.568863
H  -2.021433 1.529693 0.62672
H  -3.577577 2.281328 0.352896
H  -1.137108 2.571793 -1.455247
H  -2.67536 3.361016 -1.726661
H  -0.920763 3.794935 0.721285
H  -3.52915 -1.949845 1.126834
H  -2.723106 -0.442294 1.518338
H  -5.011519 0.667404 1.103607
H  -5.782832 0.502404 -0.47182
H  -5.709991 -0.873003 0.624794
H  -0.332434 5.973848 -0.335569
H  -1.266211 5.538461 -1.764295
H  0.180096 4.623241 -1.343878
H  -3.389113 5.314384 -0.24845
H  -3.307333 4.310948 1.197863
H  -2.372144 5.794758 1.107025
H  -1.826674 -2.363699 -0.715257
H  -0.348481 -0.734255 1.409983
H  0.047981 -3.760668 -0.902725
H  1.598504 -3.22651 -1.541242
H  0.119047 -2.37154 -1.964462
H  1.853325 -0.971456 1.498163
H  5.693618 -2.895072 0.805645
H  5.981837 -1.636283 1.999486
H  7.257838 -1.171863 -0.059565
H  5.787442 -1.149641 -1.026131
H  6.063603 0.095219 0.201044
elementType: O C H
totalener: -816.41501911 hartree
nucrepener: 1408.66825961 hartree
electener: -2225.08327872 hartree
oneelecener: -3902.71522191 hartree
twoeener: 1677.63194319 hartree
cpcmener: -0.02024014 hartree
kineticenergy: 812.45465605 hartree
xcener: -82.315914132848 hartree
chargesum: 0.0000000
charge: -0.299817 -0.515827 0.098068 -0.171509 -0.153866 -0.162942 0.082261 -0.157018 -0.338626 -0.299147 -0.307267 -0.120460 -0.156294 0.012380 -0.261751 -0.184065 0.491635 0.039643 -0.255691 0.054202 0.085401 0.080380 0.064709 0.081559 0.070190 0.065947 0.025352 0.099965 0.086734 0.082666 0.095980 0.097413 0.089864 0.080679 0.087949 0.082461 0.088896 0.091864 0.128125 0.116817 0.108366 0.106312 0.105337 0.116224 0.086497 0.109070 0.095287 0.087513 0.088536
qa: -0.2998 -0.5158 0.0981 -0.1715 -0.1539 -0.1629 0.0823 -0.1570 -0.3386 -0.2991 -0.3073 -0.1205 -0.1563 0.0124 -0.2618 -0.1841 0.4916 0.0396 -0.2557 0.0542 0.0854 0.0804 0.0647 0.0816 0.0702 0.0659 0.0254 0.1000 0.0867 0.0827 0.0960 0.0974 0.0899 0.0807 0.0879 0.0825 0.0889 0.0919 0.1281 0.1168 0.1084 0.1063 0.1053 0.1162 0.0865 0.1091 0.0953 0.0875 0.0885
va: 2.1130 1.9784 3.7686 3.8951 3.8697 3.8848 3.8061 3.9250 3.9517 3.9288 3.9277 3.8598 3.9006 3.7128 3.9197 3.7745 4.1431 3.8464 3.9178 1.0146 1.0085 1.0075 1.0082 1.0002 1.0123 1.0123 1.0187 1.0048 1.0040 0.9963 1.0024 1.0042 1.0049 1.0029 1.0048 1.0027 1.0027 1.0043 1.0017 1.0214 0.9953 1.0354 0.9968 1.0333 1.0129 0.9955 1.0071 1.0138 1.0041
dispcorr: -0.019530189 hartree
energy: -816.434549294522
dipole: -20.00377 19.03393 -0.96983 21.75880 -21.22143 0.53737 -3.56715 4.06155 0.49440
magnitude: 1.21399 au
magnitude: 3.08572 debye
