program: Orca
programVersion: 5.0.2
elementType: O O C C C C C C C C C C C C C C C C C H H H H H H H H H H H H H H H H H H H H H H H H H H H H H H
charge: 0
multiplicity: 1
keywords: wb97x-d3
keywords: def2-TZVPP
keywords: def2/J RIJCOSX
keywords: DEFGRID2
keywords: scfconv7
keywords: smallprint printgap noloewdin
keywords: NOSOSCF
formula: C17H30O2
InChI: InChI=1/C17H30O2/c1-6-19-17(18)13-16(5)12-8-11-15(4)10-7-9-14(2)3/h8,12-15H,6-7,9-11H2,1-5H3
49 atoms
O  3.940668 -3.464193 1.26188
O  4.372395 -1.33581 0.726215
C  -3.256932 -0.181538 0.463211
C  -3.077091 1.33218 0.584621
C  -3.348895 2.113992 -0.694909
C  -3.311506 3.621345 -0.473278
C  -3.658741 4.459111 -1.704781
C  -2.38079 -0.817508 -0.634529
C  -3.021492 -0.858394 1.80763
C  -3.777697 5.931492 -1.327744
C  -2.643573 4.280339 -2.828363
C  -0.926402 -0.535603 -0.468123
C  -0.02651 -1.443325 -0.073487
C  1.398505 -1.188925 0.122886
C  1.896719 0.191387 -0.163408
C  2.144232 -2.22973 0.555698
C  3.580682 -2.250052 0.837149
C  5.321555 -3.711254 1.563541
C  6.133115 -4.009246 0.32328
H  -4.296077 -0.36873 0.169743
H  -2.065407 1.555587 0.942422
H  -3.752778 1.690628 1.368506
H  -4.33144 1.832304 -1.090356
H  -2.620867 1.834004 -1.461259
H  -4.011097 3.873815 0.331136
H  -2.31816 3.913864 -0.111733
H  -4.636205 4.124968 -2.073175
H  -2.703841 -0.443704 -1.610338
H  -2.554156 -1.896626 -0.63862
H  -3.184935 -1.936011 1.74727
H  -2.002124 -0.698538 2.165198
H  -3.699472 -0.464957 2.567135
H  -2.828806 6.316117 -0.945262
H  -4.531242 6.086532 -0.55327
H  -4.05757 6.54413 -2.186789
H  -1.643333 4.573949 -2.499025
H  -2.585568 3.248306 -3.176175
H  -2.899242 4.897603 -3.691741
H  -0.608225 0.482245 -0.672697
H  -0.363696 -2.456535 0.127611
H  1.676333 0.463127 -1.19705
H  2.960515 0.30766 -0.00242
H  1.376286 0.915188 0.466381
H  1.63715 -3.173164 0.722447
H  5.305866 -4.576988 2.223652
H  5.743891 -2.876344 2.124089
H  5.724591 -4.859521 -0.222978
H  6.187523 -3.156342 -0.351979
H  7.15149 -4.263243 0.618631
elementType: O C H
totalener: -816.41499078 hartree
nucrepener: 1389.23501699 hartree
electener: -2205.65000777 hartree
oneelecener: -3863.72689033 hartree
twoeener: 1658.07688257 hartree
cpcmener: -0.02025135 hartree
kineticenergy: 812.45351113 hartree
xcener: -82.315522134498 hartree
chargesum: 0.0000000
charge: -0.298434 -0.515828 0.112781 -0.197273 -0.117865 -0.161416 0.079953 -0.141081 -0.337499 -0.298803 -0.306350 -0.125049 -0.176050 0.025059 -0.266025 -0.180949 0.487721 0.038941 -0.255015 0.044488 0.074927 0.078419 0.069145 0.062348 0.069005 0.067088 0.024276 0.102079 0.092891 0.096272 0.084489 0.095624 0.080567 0.087677 0.089748 0.082383 0.089256 0.091855 0.129190 0.116267 0.107509 0.108025 0.106946 0.116098 0.108824 0.086802 0.088615 0.087006 0.095366
qa: -0.2984 -0.5158 0.1128 -0.1973 -0.1179 -0.1614 0.0800 -0.1411 -0.3375 -0.2988 -0.3064 -0.1250 -0.1760 0.0251 -0.2660 -0.1809 0.4877 0.0389 -0.2550 0.0445 0.0749 0.0784 0.0691 0.0623 0.0690 0.0671 0.0243 0.1021 0.0929 0.0963 0.0845 0.0956 0.0806 0.0877 0.0897 0.0824 0.0893 0.0919 0.1292 0.1163 0.1075 0.1080 0.1069 0.1161 0.1088 0.0868 0.0886 0.0870 0.0954
va: 2.1140 1.9788 3.7651 3.8845 3.8613 3.8866 3.8101 3.9270 3.9590 3.9299 3.9278 3.8475 3.9096 3.6930 3.9197 3.7752 4.1451 3.8476 3.9167 1.0157 1.0020 1.0127 1.0120 1.0048 1.0124 1.0112 1.0190 1.0010 1.0130 1.0038 0.9985 1.0054 1.0029 1.0047 1.0049 1.0029 1.0026 1.0042 0.9901 1.0229 0.9958 1.0358 0.9960 1.0333 0.9956 1.0126 1.0041 1.0140 1.0070
dispcorr: -0.019529897 hartree
energy: -816.434520676788
dipole: -22.46801 21.20231 -1.26570 19.94502 -20.29325 -0.34823 -6.40018 6.23413 -0.16606
magnitude: 1.32319 au
magnitude: 3.36328 debye
