program: Orca
programVersion: 5.0.2
elementType: O O C C C C C C C C C C C C C C C C C H H H H H H H H H H H H H H H H H H H H H H H H H H H H H H
charge: 0
multiplicity: 1
keywords: wb97x-d3
keywords: def2-TZVPP
keywords: def2/J RIJCOSX
keywords: DEFGRID2
keywords: scfconv7
keywords: smallprint printgap noloewdin
keywords: NOSOSCF
formula: C17H30O2
InChI: InChI=1/C17H30O2/c1-6-19-17(18)13-16(5)12-8-11-15(4)10-7-9-14(2)3/h8,12-15H,6-7,9-11H2,1-5H3
49 atoms
O  4.329313 -2.162698 1.282533
O  3.893716 -2.462406 -0.885601
C  -3.473851 -0.184886 0.09882
C  -2.658706 1.099402 0.25018
C  -3.201376 2.291455 -0.529146
C  -2.30263 3.51617 -0.407015
C  -2.819627 4.768588 -1.116231
C  -2.736879 -1.381887 0.720997
C  -4.863057 -0.05676 0.712029
C  -1.936139 5.966411 -0.787143
C  -2.91048 4.576238 -2.626006
C  -1.458801 -1.693487 0.022904
C  -0.254701 -1.715733 0.604617
C  1.003654 -1.996429 -0.081654
C  0.941467 -2.25389 -1.553225
C  2.122697 -1.992755 0.676326
C  3.499277 -2.23159 0.240134
C  5.729225 -2.372707 1.045591
C  6.444209 -2.254291 2.367607
H  -3.590639 -0.390084 -0.972777
H  -1.631758 0.91435 -0.081553
H  -2.589009 1.353376 1.314847
H  -4.205533 2.551085 -0.17974
H  -3.308265 2.004895 -1.579989
H  -2.167514 3.745253 0.655822
H  -1.304291 3.276478 -0.792724
H  -3.827607 4.977483 -0.737868
H  -3.390864 -2.258566 0.654355
H  -2.559069 -1.198522 1.785037
H  -5.444859 0.738583 0.245219
H  -5.430621 -0.982093 0.598168
H  -4.80053 0.163434 1.780601
H  -1.886505 6.143902 0.288895
H  -2.308622 6.879655 -1.254955
H  -0.914522 5.809177 -1.142415
H  -3.603754 3.780992 -2.902345
H  -3.252362 5.488044 -3.119405
H  -1.933333 4.322715 -3.04566
H  -1.549482 -1.898596 -1.040329
H  -0.18385 -1.504169 1.667981
H  1.908523 -2.45292 -1.996188
H  0.501642 -1.396064 -2.064854
H  0.291037 -3.105917 -1.757809
H  2.010181 -1.790759 1.735336
H  6.099465 -1.628408 0.337454
H  5.885887 -3.361058 0.608664
H  7.510673 -2.413073 2.210017
H  6.31734 -1.265535 2.808683
H  6.099092 -3.001728 3.082094
elementType: O C H
totalener: -816.41688867 hartree
nucrepener: 1374.06409762 hartree
electener: -2190.48098629 hartree
oneelecener: -3833.47629957 hartree
twoeener: 1642.99531328 hartree
cpcmener: -0.02075155 hartree
kineticenergy: 812.45673343 hartree
xcener: -82.313896529438 hartree
chargesum: -0.0000000
charge: -0.292550 -0.516109 0.091845 -0.177305 -0.123750 -0.158963 0.075908 -0.115305 -0.321744 -0.299090 -0.306958 -0.130787 -0.164077 0.022710 -0.262853 -0.173178 0.483470 0.039077 -0.253301 0.040084 0.076123 0.068531 0.065468 0.065739 0.068549 0.066255 0.026390 0.096419 0.080740 0.093339 0.092457 0.085204 0.088246 0.090019 0.080415 0.090310 0.091235 0.082583 0.125055 0.116473 0.107584 0.106575 0.106516 0.116390 0.095891 0.095530 0.089109 0.087958 0.087775
qa: -0.2926 -0.5161 0.0918 -0.1773 -0.1238 -0.1590 0.0759 -0.1153 -0.3217 -0.2991 -0.3070 -0.1308 -0.1641 0.0227 -0.2629 -0.1732 0.4835 0.0391 -0.2533 0.0401 0.0761 0.0685 0.0655 0.0657 0.0685 0.0663 0.0264 0.0964 0.0807 0.0933 0.0925 0.0852 0.0882 0.0900 0.0804 0.0903 0.0912 0.0826 0.1251 0.1165 0.1076 0.1066 0.1065 0.1164 0.0959 0.0955 0.0891 0.0880 0.0878
va: 2.1157 1.9834 3.7677 3.8996 3.8754 3.8831 3.8127 3.9095 3.9454 3.9299 3.9278 3.8754 3.9073 3.6964 3.9205 3.7793 4.1361 3.8454 3.9707 1.0229 1.0094 1.0131 1.0106 1.0094 1.0115 1.0121 1.0186 1.0053 1.0153 1.0022 1.0041 1.0009 1.0047 1.0049 1.0031 1.0022 1.0042 1.0027 1.0046 1.0224 1.0360 0.9961 0.9959 1.0319 0.9960 0.9960 1.0062 1.0034 1.0033
dispcorr: -0.018394608 hartree
energy: -816.435283278827
dipole: -21.85913 20.79562 -1.06351 22.11337 -21.84862 0.26476 -2.61468 3.31510 0.70042
magnitude: 1.30067 au
magnitude: 3.30604 debye
