program: Orca
programVersion: 5.0.2
elementType: O O C C C C C C C C C C C C C C C C C H H H H H H H H H H H H H H H H H H H H H H H H H H H H H H
charge: 0
multiplicity: 1
keywords: wb97x-d3
keywords: def2-TZVPP
keywords: def2/J RIJCOSX
keywords: DEFGRID2
keywords: scfconv7
keywords: smallprint printgap noloewdin
keywords: NOSOSCF
formula: C17H30O2
InChI: InChI=1/C17H30O2/c1-6-19-17(18)13-16(5)12-8-11-15(4)10-7-9-14(2)3/h8,12-15H,6-7,9-11H2,1-5H3
49 atoms
O  4.086018 -1.212989 1.260836
O  3.726012 -1.753124 -0.880258
C  -3.807916 -0.304611 0.045207
C  -3.098229 1.033397 0.256459
C  -3.606307 2.157838 -0.636733
C  -2.906408 3.494211 -0.399201
C  -1.38214 3.486091 -0.544758
C  -3.00228 -1.459575 0.665882
C  -5.223658 -0.29326 0.608376
C  -0.934582 2.954399 -1.901004
C  -0.827424 4.886944 -0.312263
C  -1.693983 -1.659334 -0.018057
C  -0.499306 -1.511278 0.564468
C  0.789311 -1.642448 -0.110552
C  0.770789 -1.952309 -1.573037
C  1.8913 -1.449394 0.647713
C  3.292051 -1.500956 0.225809
C  5.507858 -1.217601 1.066143
C  6.09203 -2.610476 1.126749
H  -3.869625 -0.490729 -1.034498
H  -2.028564 0.8994 0.07461
H  -3.189291 1.324964 1.310064
H  -4.679709 2.303325 -0.485439
H  -3.492599 1.858556 -1.683643
H  -3.317606 4.234786 -1.094772
H  -3.15777 3.852887 0.604853
H  -0.962787 2.833016 0.228408
H  -3.591169 -2.378826 0.576889
H  -2.854312 -1.276287 1.734421
H  -5.212067 -0.128329 1.688428
H  -5.833053 0.493481 0.161893
H  -5.732465 -1.241202 0.424222
H  -1.362992 3.544562 -2.715484
H  -1.229499 1.915158 -2.056966
H  0.151717 2.998579 -1.999792
H  -1.197984 5.586526 -1.065826
H  -1.116485 5.275095 0.666431
H  0.263003 4.898132 -0.361445
H  -1.753555 -1.912044 -1.07309
H  -0.462362 -1.255279 1.619603
H  1.757602 -2.032119 -2.010045
H  0.221512 -1.177284 -2.110763
H  0.242349 -2.890054 -1.753087
H  1.742294 -1.220402 1.696703
H  5.895536 -0.608669 1.881218
H  5.764749 -0.719182 0.130447
H  5.845301 -3.103529 2.067116
H  5.752725 -3.239778 0.305056
H  7.178414 -2.541339 1.06436
elementType: O C H
totalener: -816.41432601 hartree
nucrepener: 1428.52063083 hartree
electener: -2244.93495684 hartree
oneelecener: -3942.44370383 hartree
twoeener: 1697.50874699 hartree
cpcmener: -0.02012425 hartree
kineticenergy: 812.45538283 hartree
xcener: -82.316196448552 hartree
chargesum: -0.0000000
charge: -0.299127 -0.516417 0.072416 -0.169261 -0.129239 -0.198417 0.079821 -0.104734 -0.310301 -0.308956 -0.302158 -0.122401 -0.174714 0.022449 -0.260000 -0.182564 0.492784 0.038299 -0.255979 0.042039 0.065422 0.075480 0.081304 0.069448 0.075928 0.075172 0.033429 0.094874 0.080116 0.083157 0.091416 0.091716 0.087829 0.084231 0.092274 0.081422 0.088876 0.090250 0.123307 0.116934 0.106874 0.105269 0.107221 0.116113 0.109302 0.087471 0.088262 0.087157 0.096204
qa: -0.2991 -0.5164 0.0724 -0.1693 -0.1292 -0.1984 0.0798 -0.1047 -0.3103 -0.3090 -0.3022 -0.1224 -0.1747 0.0224 -0.2600 -0.1826 0.4928 0.0383 -0.2560 0.0420 0.0654 0.0755 0.0813 0.0694 0.0759 0.0752 0.0334 0.0949 0.0801 0.0832 0.0914 0.0917 0.0878 0.0842 0.0923 0.0814 0.0889 0.0903 0.1233 0.1169 0.1069 0.1053 0.1072 0.1161 0.1093 0.0875 0.0883 0.0872 0.0962
va: 2.1133 1.9784 3.7789 3.8853 3.8779 3.9112 3.7675 3.9085 3.9449 3.9362 3.9295 3.8690 3.9010 3.6899 3.9205 3.7716 4.1419 3.8480 3.9153 1.0225 1.0041 1.0138 1.0142 1.0029 1.0105 1.0086 1.0141 1.0058 1.0152 1.0018 1.0039 1.0040 1.0029 1.0001 1.0052 1.0040 1.0040 1.0043 1.0046 1.0221 1.0358 0.9957 0.9964 1.0332 0.9955 1.0121 1.0041 1.0144 1.0068
dispcorr: -0.020156404 hartree
energy: -816.434482419447
dipole: -18.95057 17.93522 -1.01536 15.05312 -14.92485 0.12827 -2.94092 3.59964 0.65872
magnitude: 1.21709 au
magnitude: 3.09360 debye
