program: Orca
programVersion: 5.0.2
elementType: O O C C C C C C C C C C C C C C C C C H H H H H H H H H H H H H H H H H H H H H H H H H H H H H H
charge: 0
multiplicity: 1
keywords: wb97x-d3
keywords: def2-TZVPP
keywords: def2/J RIJCOSX
keywords: DEFGRID2
keywords: scfconv7
keywords: smallprint printgap noloewdin
keywords: NOSOSCF
formula: C17H30O2
InChI: InChI=1/C17H30O2/c1-6-19-17(18)13-16(5)12-8-11-15(4)10-7-9-14(2)3/h8,12-15H,6-7,9-11H2,1-5H3
49 atoms
O  5.195266 -2.286716 0.929171
O  3.812762 -4.039534 0.787171
C  -2.27823 0.74111 -0.181234
C  -3.091312 1.925919 -0.704878
C  -4.444819 2.106114 -0.026226
C  -5.340564 3.138542 -0.70601
C  -4.784808 4.562405 -0.779319
C  -1.022525 0.548627 -1.044622
C  -1.903217 0.906164 1.286426
C  -5.776613 5.471681 -1.496045
C  -4.452685 5.120173 0.599668
C  -0.28094 -0.704238 -0.72897
C  0.997759 -0.750485 -0.339955
C  1.745484 -1.968396 -0.03706
C  1.021648 -3.270667 -0.165847
C  3.036866 -1.80781 0.328237
C  4.006042 -2.84465 0.68781
C  6.295647 -3.130471 1.298757
C  6.949388 -3.781803 0.101164
H  -2.894559 -0.161095 -0.282321
H  -3.253897 1.790736 -1.780236
H  -2.492654 2.837931 -0.601213
H  -4.30954 2.370896 1.025893
H  -4.969352 1.144915 -0.024861
H  -5.5630 2.796736 -1.722884
H  -6.303001 3.169954 -0.182123
H  -3.861682 4.546746 -1.369513
H  -0.364241 1.416875 -0.940043
H  -1.331102 0.509032 -2.095757
H  -2.782627 0.992754 1.92536
H  -1.323218 0.057581 1.653569
H  -1.298012 1.805203 1.432203
H  -6.716134 5.540883 -0.94143
H  -6.011519 5.099603 -2.495392
H  -5.385329 6.484905 -1.605786
H  -3.676649 4.542334 1.10463
H  -4.09528 6.149686 0.53181
H  -5.33513 5.121782 1.245438
H  -0.850122 -1.623917 -0.835591
H  1.544196 0.183102 -0.237996
H  0.615431 -3.375868 -1.17337
H  0.1702 -3.296326 0.517082
H  1.644248 -4.132637 0.038315
H  3.424095 -0.795749 0.363288
H  5.975952 -3.874465 2.030258
H  6.996491 -2.460939 1.79518
H  6.291611 -4.493806 -0.396793
H  7.27261 -3.037936 -0.627912
H  7.834569 -4.325196 0.434354
elementType: O C H
totalener: -816.41508867 hartree
nucrepener: 1355.02656691 hartree
electener: -2171.44165558 hartree
oneelecener: -3795.35458687 hartree
twoeener: 1623.91293129 hartree
cpcmener: -0.02027160 hartree
kineticenergy: 812.44075048 hartree
xcener: -82.312472900731 hartree
chargesum: -0.0000000
charge: -0.298594 -0.515846 0.109307 -0.186703 -0.125942 -0.195036 0.073394 -0.100287 -0.339693 -0.300819 -0.307594 -0.158119 -0.141518 0.008738 -0.261421 -0.178015 0.488895 0.039624 -0.254890 0.042497 0.075429 0.069769 0.070638 0.079015 0.073297 0.077758 0.034143 0.079849 0.093786 0.098302 0.097578 0.084581 0.081048 0.088531 0.089845 0.086918 0.092422 0.085449 0.126407 0.114630 0.105749 0.107926 0.106002 0.116775 0.086650 0.108929 0.086839 0.087587 0.096169
qa: -0.2986 -0.5158 0.1093 -0.1867 -0.1259 -0.1950 0.0734 -0.1003 -0.3397 -0.3008 -0.3076 -0.1581 -0.1415 0.0087 -0.2614 -0.1780 0.4889 0.0396 -0.2549 0.0425 0.0754 0.0698 0.0706 0.0790 0.0733 0.0778 0.0341 0.0798 0.0938 0.0983 0.0976 0.0846 0.0810 0.0885 0.0898 0.0869 0.0924 0.0854 0.1264 0.1146 0.1057 0.1079 0.1060 0.1168 0.0867 0.1089 0.0868 0.0876 0.0962
va: 2.1133 1.9786 3.7506 3.8942 3.8664 3.9150 3.7813 3.9094 3.9500 3.9279 3.9336 3.8901 3.9167 3.7091 3.9227 3.7688 4.1448 3.8484 3.9141 1.0233 1.0116 1.0080 1.0025 1.0109 1.0090 1.0102 1.0159 1.0164 1.0066 1.0021 1.0028 1.0031 1.0038 1.0042 1.0047 1.0006 1.0053 1.0024 1.0042 1.0236 0.9957 0.9960 1.0350 1.0330 1.0121 0.9957 1.0145 1.0044 1.0069
dispcorr: -0.019130205 hartree
energy: -816.434218874969
dipole: -29.08445 28.57768 -0.50677 23.43172 -22.39398 1.03774 -3.12911 2.75712 -0.37199
magnitude: 1.21330 au
magnitude: 3.08397 debye
