program: Orca
programVersion: 5.0.2
elementType: O O C C C C C C C C C C C C C C C C C H H H H H H H H H H H H H H H H H H H H H H H H H H H H H H
charge: 0
multiplicity: 1
keywords: wb97x-d3
keywords: def2-TZVPP
keywords: def2/J RIJCOSX
keywords: DEFGRID2
keywords: scfconv7
keywords: smallprint printgap noloewdin
keywords: NOSOSCF
formula: C17H30O2
InChI: InChI=1/C17H30O2/c1-6-19-17(18)13-16(5)12-8-11-15(4)10-7-9-14(2)3/h8,12-15H,6-7,9-11H2,1-5H3
49 atoms
O  4.26154 -1.997835 1.35932
O  3.802638 -2.647833 -0.730723
C  -3.561243 -0.190096 -0.113956
C  -2.759283 1.105223 -0.240823
C  -3.337419 2.109033 -1.23271
C  -2.404494 3.283254 -1.518398
C  -2.051946 4.161155 -0.315671
C  -2.798924 -1.231202 0.721017
C  -4.939533 0.049338 0.489872
C  -1.052553 5.236947 -0.725361
C  -3.290292 4.793297 0.308533
C  -1.528756 -1.666381 0.074973
C  -0.318153 -1.592428 0.638667
C  0.930754 -2.001154 0.000435
C  0.852154 -2.503578 -1.40563
C  2.056986 -1.884527 0.738439
C  3.425232 -2.220442 0.34147
C  5.661462 -2.251767 1.169259
C  6.363067 -1.108169 0.472378
H  -3.695812 -0.60744 -1.119884
H  -1.737241 0.865878 -0.554154
H  -2.669906 1.559046 0.75277
H  -4.305665 2.478719 -0.884772
H  -3.538679 1.593089 -2.17729
H  -1.477002 2.894192 -1.953069
H  -2.855488 3.917944 -2.289734
H  -1.571165 3.534963 0.444127
H  -3.442808 -2.109302 0.84541
H  -2.604475 -0.837241 1.723187
H  -5.535294 0.736533 -0.111653
H  -5.502789 -0.882061 0.571507
H  -4.857986 0.474894 1.493251
H  -0.759242 5.854768 0.125495
H  -1.477062 5.9011 -1.482566
H  -0.143393 4.800614 -1.143659
H  -3.835031 5.39236 -0.426012
H  -3.982121 4.047129 0.702329
H  -3.022516 5.45265 1.136239
H  -1.63209 -2.061209 -0.932158
H  -0.234177 -1.197166 1.647307
H  0.393716 -1.750005 -2.047944
H  0.211346 -3.385856 -1.454358
H  1.81586 -2.763133 -1.823989
H  1.957505 -1.503297 1.748296
H  5.807999 -3.191685 0.635372
H  6.054677 -2.38018 2.176365
H  6.236118 -0.172748 1.017331
H  7.431073 -1.323243 0.427428
H  6.011653 -0.965119 -0.548697
elementType: O C H
totalener: -816.41501965 hartree
nucrepener: 1398.30351429 hartree
electener: -2214.71853394 hartree
oneelecener: -3881.97695234 hartree
twoeener: 1667.25841840 hartree
cpcmener: -0.02010626 hartree
kineticenergy: 812.45329482 hartree
xcener: -82.315270993166 hartree
chargesum: -0.0000000
charge: -0.299913 -0.516022 0.091648 -0.183249 -0.138661 -0.188807 0.067569 -0.112924 -0.320113 -0.299558 -0.305515 -0.136482 -0.161014 0.022871 -0.264545 -0.184589 0.493388 0.039992 -0.255992 0.040233 0.081751 0.070090 0.072518 0.079570 0.072539 0.079518 0.036260 0.096630 0.080969 0.093234 0.092818 0.084253 0.089530 0.081276 0.088971 0.084863 0.087700 0.091738 0.126023 0.116099 0.106234 0.107713 0.107794 0.116570 0.086675 0.109055 0.088284 0.095960 0.087047
qa: -0.2999 -0.5160 0.0916 -0.1832 -0.1387 -0.1888 0.0676 -0.1129 -0.3201 -0.2996 -0.3055 -0.1365 -0.1610 0.0229 -0.2645 -0.1846 0.4934 0.0400 -0.2560 0.0402 0.0818 0.0701 0.0725 0.0796 0.0725 0.0795 0.0363 0.0966 0.0810 0.0932 0.0928 0.0843 0.0895 0.0813 0.0890 0.0849 0.0877 0.0917 0.1260 0.1161 0.1062 0.1077 0.1078 0.1166 0.0867 0.1091 0.0883 0.0960 0.0870
va: 2.1134 1.9781 3.7704 3.8777 3.8774 3.9081 3.7857 3.9081 3.9458 3.9277 3.9326 3.8804 3.9078 3.6966 3.9195 3.7750 4.1412 3.8469 3.9168 1.0236 1.0076 1.0101 1.0026 1.0111 1.0091 1.0108 1.0157 1.0052 1.0158 1.0018 1.0046 1.0018 1.0046 1.0037 1.0043 1.0027 1.0007 1.0052 1.0044 1.0226 0.9964 0.9954 1.0357 1.0329 1.0127 0.9957 1.0042 1.0068 1.0142
dispcorr: -0.019393865 hartree
energy: -816.434413515137
dipole: -21.49989 20.52486 -0.97503 22.86731 -22.49551 0.37180 -3.20876 3.79667 0.58791
magnitude: 1.19773 au
magnitude: 3.04439 debye
