program: Orca
programVersion: 5.0.2
elementType: O O C C C C C C C C C C C C C C C C C H H H H H H H H H H H H H H H H H H H H H H H H H H H H H H
charge: 0
multiplicity: 1
keywords: wb97x-d3
keywords: def2-TZVPP
keywords: def2/J RIJCOSX
keywords: DEFGRID2
keywords: scfconv7
keywords: smallprint printgap noloewdin
keywords: NOSOSCF
formula: C17H30O2
InChI: InChI=1/C17H30O2/c1-6-19-17(18)13-16(5)12-8-11-15(4)10-7-9-14(2)3/h8,12-15H,6-7,9-11H2,1-5H3
49 atoms
O  4.253663 -2.804625 1.608587
O  4.203872 -2.2465 -0.555867
C  -3.195613 0.13979 0.03163
C  -2.390264 1.239425 0.725463
C  -2.844205 2.669522 0.444373
C  -2.741492 3.062558 -1.025828
C  -2.923913 4.556952 -1.295511
C  -2.573814 -1.239935 0.299271
C  -4.655223 0.144459 0.467297
C  -2.649803 4.872208 -2.761264
C  -4.312813 5.04429 -0.898488
C  -1.200018 -1.371712 -0.262009
C  -0.117182 -1.711458 0.44592
C  1.235603 -1.831343 -0.092002
C  1.427877 -1.520461 -1.542089
C  2.200529 -2.211412 0.774934
C  3.624799 -2.404568 0.499681
C  5.666956 -3.046459 1.546206
C  6.474967 -1.77413 1.661481
H  -3.16145 0.305688 -1.051465
H  -1.338088 1.152073 0.43479
H  -2.41967 1.057941 1.806051
H  -2.217714 3.346943 1.033918
H  -3.864662 2.819436 0.806676
H  -1.758703 2.755487 -1.401717
H  -3.478127 2.506994 -1.617844
H  -2.187171 5.098633 -0.689843
H  -3.212732 -1.999047 -0.166296
H  -2.569047 -1.446722 1.373877
H  -4.742163 0.009222 1.548293
H  -5.154888 1.079539 0.211132
H  -5.21296 -0.661933 -0.012362
H  -2.739343 5.941094 -2.963876
H  -3.357599 4.354469 -3.413581
H  -1.644716 4.56476 -3.056409
H  -5.086782 4.499925 -1.446141
H  -4.509153 4.913408 0.166375
H  -4.437464 6.105466 -1.122368
H  -1.109036 -1.16557 -1.32509
H  -0.23086 -1.915645 1.507042
H  1.080118 -0.50847 -1.755892
H  0.823139 -2.192911 -2.153235
H  2.456595 -1.60186 -1.868071
H  1.905782 -2.403311 1.800181
H  5.917225 -3.594427 0.636775
H  5.869602 -3.701397 2.392029
H  6.311917 -1.099817 0.821858
H  6.246708 -1.241012 2.584469
H  7.534954 -2.02942 1.679772
elementType: O C H
totalener: -816.41502854 hartree
nucrepener: 1386.44079528 hartree
electener: -2202.85582383 hartree
oneelecener: -3858.23315275 hartree
twoeener: 1655.37732892 hartree
cpcmener: -0.02012528 hartree
kineticenergy: 812.45421364 hartree
xcener: -82.315444405541 hartree
chargesum: -0.0000000
charge: -0.300501 -0.515980 0.080098 -0.192170 -0.146969 -0.150987 0.067396 -0.128631 -0.322476 -0.295061 -0.303483 -0.134027 -0.150337 0.016571 -0.262179 -0.182069 0.493160 0.039152 -0.255081 0.049211 0.078770 0.081591 0.077616 0.072914 0.072608 0.065648 0.026325 0.096551 0.080508 0.087439 0.092426 0.092976 0.089889 0.080404 0.087749 0.081717 0.090531 0.091482 0.127359 0.115870 0.105888 0.107512 0.107366 0.116577 0.087273 0.109167 0.086680 0.088104 0.095424
qa: -0.3005 -0.5160 0.0801 -0.1922 -0.1470 -0.1510 0.0674 -0.1286 -0.3225 -0.2951 -0.3035 -0.1340 -0.1503 0.0166 -0.2622 -0.1821 0.4932 0.0392 -0.2551 0.0492 0.0788 0.0816 0.0776 0.0729 0.0726 0.0656 0.0263 0.0966 0.0805 0.0874 0.0924 0.0930 0.0899 0.0804 0.0877 0.0817 0.0905 0.0915 0.1274 0.1159 0.1059 0.1075 0.1074 0.1166 0.0873 0.1092 0.0867 0.0881 0.0954
va: 2.1133 1.9781 3.7432 3.9154 3.8854 3.8574 3.8241 3.9117 3.9546 3.9283 3.9283 3.8748 3.9025 3.7016 3.9183 3.7728 4.1411 3.8469 3.9163 1.0211 1.0088 1.0122 1.0109 1.0012 1.0113 1.0111 1.0193 1.0052 1.0158 1.0011 0.9999 1.0050 1.0051 1.0034 1.0050 1.0031 1.0023 1.0048 1.0039 1.0225 0.9967 0.9956 1.0355 1.0329 1.0124 0.9957 1.0147 1.0042 1.0070
dispcorr: -0.019385102 hartree
energy: -816.434413646329
dipole: -24.64539 23.59252 -1.05286 23.35355 -23.18596 0.16759 -4.87784 5.44018 0.56234
magnitude: 1.20533 au
magnitude: 3.06372 debye
