program: Orca
programVersion: 5.0.2
elementType: O O C C C C C C C C C C C C C C C C C H H H H H H H H H H H H H H H H H H H H H H H H H H H H H H
charge: 0
multiplicity: 1
keywords: wb97x-d3
keywords: def2-TZVPP
keywords: def2/J RIJCOSX
keywords: DEFGRID2
keywords: scfconv7
keywords: smallprint printgap noloewdin
keywords: NOSOSCF
formula: C17H30O2
InChI: InChI=1/C17H30O2/c1-6-19-17(18)13-16(5)12-8-11-15(4)10-7-9-14(2)3/h8,12-15H,6-7,9-11H2,1-5H3
49 atoms
O  3.944905 -1.073639 1.042902
O  3.447997 -2.554122 -0.557707
C  -4.033744 -0.479811 -0.246265
C  -3.264779 0.599369 -1.014222
C  -2.700959 1.735774 -0.168879
C  -1.902061 2.727556 -1.006152
C  -1.329378 3.913455 -0.228155
C  -3.171525 -1.171535 0.82288
C  -5.314048 0.056965 0.382619
C  -0.300275 3.475524 0.808126
C  -0.717564 4.929388 -1.18572
C  -1.90884 -1.732969 0.268104
C  -0.683543 -1.375931 0.668855
C  0.566082 -1.894387 0.119312
C  0.466193 -2.900368 -0.981947
C  1.710649 -1.412052 0.652412
C  3.084109 -1.759473 0.285383
C  5.351715 -1.253887 0.823413
C  5.861103 -0.418676 -0.329409
H  -4.318529 -1.245473 -0.976896
H  -3.926137 1.016031 -1.781195
H  -2.44051 0.127775 -1.560017
H  -2.065594 1.32572 0.620692
H  -3.512282 2.266834 0.339077
H  -1.079393 2.200863 -1.505441
H  -2.545084 3.108577 -1.807367
H  -2.157565 4.401571 0.299724
H  -3.761687 -1.98739 1.254372
H  -2.950944 -0.480053 1.640163
H  -5.900329 -0.747953 0.829637
H  -5.106169 0.783301 1.170536
H  -5.943916 0.547941 -0.361496
H  0.527751 2.941626 0.333921
H  -0.72682 2.81472 1.56382
H  0.121496 4.334794 1.332978
H  0.114458 4.491211 -1.742847
H  -1.449325 5.285406 -1.913358
H  -0.332571 5.800598 -0.652517
H  -2.027829 -2.463262 -0.527485
H  -0.589106 -0.637441 1.460499
H  -0.095368 -3.773027 -0.644197
H  1.428208 -3.236966 -1.345816
H  -0.08836 -2.479588 -1.822491
H  1.624144 -0.679219 1.446444
H  5.583538 -2.310241 0.681282
H  5.817077 -0.937353 1.75542
H  5.426956 -0.718133 -1.282622
H  5.657898 0.640718 -0.172857
H  6.941954 -0.541287 -0.404902
elementType: O C H
totalener: -816.41487721 hartree
nucrepener: 1438.69121562 hartree
electener: -2255.10609283 hartree
oneelecener: -3962.80144469 hartree
twoeener: 1707.69535186 hartree
cpcmener: -0.02024871 hartree
kineticenergy: 812.45797605 hartree
xcener: -82.317104610134 hartree
chargesum: -0.0000000
charge: -0.300084 -0.516273 0.086587 -0.162192 -0.150819 -0.158907 0.084451 -0.147815 -0.335264 -0.309355 -0.299543 -0.112941 -0.171989 0.023177 -0.263800 -0.186919 0.493350 0.040065 -0.255544 0.055034 0.086649 0.077852 0.058242 0.076484 0.065302 0.070001 0.023636 0.100041 0.082928 0.095849 0.084268 0.094505 0.081757 0.091068 0.092788 0.081175 0.087824 0.089793 0.129724 0.116332 0.107856 0.106070 0.106736 0.115543 0.086348 0.108801 0.087200 0.088635 0.095373
qa: -0.3001 -0.5163 0.0866 -0.1622 -0.1508 -0.1589 0.0845 -0.1478 -0.3353 -0.3094 -0.2995 -0.1129 -0.1720 0.0232 -0.2638 -0.1869 0.4933 0.0401 -0.2555 0.0550 0.0866 0.0779 0.0582 0.0765 0.0653 0.0700 0.0236 0.1000 0.0829 0.0958 0.0843 0.0945 0.0818 0.0911 0.0928 0.0812 0.0878 0.0898 0.1297 0.1163 0.1079 0.1061 0.1067 0.1155 0.0863 0.1088 0.0872 0.0886 0.0954
va: 2.1138 1.9778 3.7885 3.8898 3.8693 3.8779 3.8063 3.9239 3.9503 3.9272 3.9299 3.8485 3.9028 3.6898 3.9193 3.7714 4.1422 3.8469 3.9173 1.0138 1.0087 1.0072 1.0046 1.0096 1.0131 1.0122 1.0190 1.0062 1.0043 1.0035 0.9966 1.0030 1.0033 1.0008 1.0049 1.0027 1.0047 1.0051 1.0006 1.0207 0.9959 1.0357 0.9963 1.0339 1.0130 0.9957 1.0139 1.0040 1.0069
dispcorr: -0.020383956 hartree
energy: -816.435261162165
dipole: -16.65354 15.59204 -1.06150 18.73130 -18.15085 0.58045 -3.53252 3.98127 0.44874
magnitude: 1.29038 au
magnitude: 3.27988 debye
