program: Orca
programVersion: 5.0.2
elementType: O O C C C C C C C C C C C C C C C C C H H H H H H H H H H H H H H H H H H H H H H H H H H H H H H
charge: 0
multiplicity: 1
keywords: wb97x-d3
keywords: def2-TZVPP
keywords: def2/J RIJCOSX
keywords: DEFGRID2
keywords: scfconv7
keywords: smallprint printgap noloewdin
keywords: NOSOSCF
formula: C17H30O2
InChI: InChI=1/C17H30O2/c1-6-19-17(18)13-16(5)12-8-11-15(4)10-7-9-14(2)3/h8,12-15H,6-7,9-11H2,1-5H3
49 atoms
O  4.817486 -2.66347 0.304527
O  4.04176 -4.541178 -0.626455
C  -1.731358 1.208034 -0.054864
C  -3.225796 1.528518 -0.10273
C  -3.558494 2.937635 -0.579225
C  -5.051771 3.235857 -0.507163
C  -5.459159 4.602276 -1.06063
C  -1.514088 -0.164409 0.602882
C  -1.092261 1.25472 -1.437241
C  -6.977685 4.721578 -1.120209
C  -4.870097 5.750075 -0.247869
C  -0.07729 -0.462303 0.859927
C  0.587905 -1.498881 0.339244
C  2.006058 -1.789878 0.548165
C  2.760447 -0.881137 1.465779
C  2.496279 -2.862828 -0.111377
C  3.843646 -3.436168 -0.156509
C  6.158405 -3.181816 0.337881
C  6.396825 -4.071181 1.53571
H  -1.244615 1.960819 0.57783
H  -3.645126 1.39045 0.899976
H  -3.728039 0.79603 -0.745479
H  -3.220872 3.078391 -1.610416
H  -2.999279 3.656797 0.027198
H  -5.589658 2.458489 -1.061244
H  -5.391603 3.156027 0.532473
H  -5.074764 4.677556 -2.08503
H  -1.960958 -0.946888 -0.017949
H  -2.046962 -0.173499 1.560243
H  -1.17419 2.243053 -1.889892
H  -0.030349 1.007615 -1.399204
H  -1.57254 0.540025 -2.110777
H  -7.416807 4.651205 -0.121852
H  -7.41752 3.929877 -1.729584
H  -7.286921 5.676979 -1.547945
H  -5.186673 6.716205 -0.645164
H  -5.199662 5.69864 0.793107
H  -3.779542 5.742453 -0.249164
H  0.435984 0.242142 1.508354
H  0.052831 -2.183013 -0.31343
H  2.21273 -0.755257 2.400203
H  2.852137 0.111519 1.02034
H  3.754151 -1.23396 1.708895
H  1.795712 -3.439388 -0.705083
H  6.78845 -2.296072 0.391744
H  6.386818 -3.697458 -0.595413
H  6.194447 -3.543713 2.467858
H  5.790505 -4.975656 1.50879
H  7.443979 -4.374886 1.546953
elementType: O C H
totalener: -816.41363158 hartree
nucrepener: 1348.23806478 hartree
electener: -2164.65169636 hartree
oneelecener: -3781.53670158 hartree
twoeener: 1616.88500522 hartree
cpcmener: -0.02260949 hartree
kineticenergy: 812.45737207 hartree
xcener: -82.314256999827 hartree
chargesum: 0.0000000
charge: -0.293335 -0.524716 0.110562 -0.182920 -0.119147 -0.160499 0.074011 -0.105401 -0.341508 -0.298827 -0.305051 -0.157530 -0.143704 0.009344 -0.255492 -0.172231 0.477332 0.037446 -0.254341 0.043421 0.071758 0.070256 0.065120 0.066213 0.068282 0.066372 0.025714 0.079510 0.093838 0.097879 0.097520 0.085596 0.080342 0.088014 0.090233 0.091167 0.081822 0.090352 0.126294 0.115515 0.103150 0.113104 0.103322 0.114466 0.107707 0.093633 0.089782 0.087241 0.098386
qa: -0.2933 -0.5247 0.1106 -0.1829 -0.1191 -0.1605 0.0740 -0.1054 -0.3415 -0.2988 -0.3051 -0.1575 -0.1437 0.0093 -0.2555 -0.1722 0.4773 0.0374 -0.2543 0.0434 0.0718 0.0703 0.0651 0.0662 0.0683 0.0664 0.0257 0.0795 0.0938 0.0979 0.0975 0.0856 0.0803 0.0880 0.0902 0.0912 0.0818 0.0904 0.1263 0.1155 0.1031 0.1131 0.1033 0.1145 0.1077 0.0936 0.0898 0.0872 0.0984
va: 2.1187 1.9621 3.7458 3.9144 3.8679 3.8911 3.8156 3.9191 3.9513 3.9303 3.9274 3.8857 3.9135 3.7310 3.9296 3.8188 4.1406 3.8299 3.9228 1.0226 1.0119 1.0106 1.0100 1.0091 1.0113 1.0122 1.0186 1.0164 1.0062 1.0021 1.0020 1.0024 1.0031 1.0047 1.0046 1.0043 1.0028 1.0025 1.0051 1.0226 0.9965 0.9951 1.0262 1.0330 0.9978 1.0130 1.0029 1.0146 1.0066
dispcorr: -0.018874384 hartree
energy: -816.432505964091
dipole: -28.19689 27.90539 -0.29150 28.37403 -26.53854 1.83549 0.24065 0.69608 0.93673
magnitude: 2.08121 au
magnitude: 5.29002 debye
