program: Orca
programVersion: 5.0.2
elementType: O O C C C C C C C C C C C C C C C C C H H H H H H H H H H H H H H H H H H H H H H H H H H H H H H
charge: 0
multiplicity: 1
keywords: wb97x-d3
keywords: def2-TZVPP
keywords: def2/J RIJCOSX
keywords: DEFGRID2
keywords: scfconv7
keywords: smallprint printgap noloewdin
keywords: NOSOSCF
formula: C17H30O2
InChI: InChI=1/C17H30O2/c1-6-19-17(18)13-16(5)12-8-11-15(4)10-7-9-14(2)3/h8,12-15H,6-7,9-11H2,1-5H3
49 atoms
O  5.096767 -2.546974 -0.02707
O  3.697285 -4.092904 0.770234
C  -2.084553 0.641342 -1.032707
C  -2.627272 2.007634 -1.460994
C  -3.566913 2.693056 -0.474238
C  -4.038391 4.044035 -1.00339
C  -4.995861 4.82039 -0.094302
C  -1.184167 0.761396 0.209916
C  -3.195903 -0.383592 -0.833393
C  -6.308178 4.077344 0.13223
C  -4.35029 5.199308 1.23451
C  -0.452608 -0.502907 0.508208
C  0.859819 -0.664737 0.306617
C  1.605051 -1.898709 0.54085
C  0.843413 -3.074038 1.065152
C  2.924989 -1.87092 0.252409
C  3.89408 -2.961063 0.374431
C  6.185647 -3.480414 0.019185
C  7.420919 -2.767815 -0.470401
H  -1.449063 0.28856 -1.852753
H  -3.14856 1.884045 -2.416473
H  -1.780049 2.671369 -1.665036
H  -3.061393 2.828756 0.48609
H  -4.429569 2.05008 -0.27888
H  -3.160732 4.668983 -1.202068
H  -4.523704 3.891543 -1.973739
H  -5.233753 5.752074 -0.619689
H  -1.798386 1.032769 1.07454
H  -0.468411 1.573823 0.056813
H  -3.801197 -0.159817 0.047194
H  -3.864636 -0.406666 -1.695998
H  -2.79934 -1.392062 -0.706581
H  -6.774335 3.7886 -0.812244
H  -7.023254 4.699929 0.673445
H  -6.162671 3.168713 0.719884
H  -4.143503 4.321321 1.849763
H  -3.40619 5.727425 1.084637
H  -5.002983 5.853842 1.815325
H  -1.046587 -1.329703 0.884966
H  1.435224 0.177703 -0.068046
H  0.037468 -3.335508 0.376999
H  0.371194 -2.821364 2.016019
H  1.45652 -3.953324 1.216018
H  3.336449 -0.94156 -0.124399
H  5.960167 -4.343382 -0.610732
H  6.324104 -3.837154 1.041927
H  7.308244 -2.424099 -1.498875
H  7.669995 -1.912359 0.157771
H  8.263958 -3.457632 -0.44144
elementType: O C H
totalener: -816.41368954 hartree
nucrepener: 1354.55825526 hartree
electener: -2170.97194480 hartree
oneelecener: -3794.33548766 hartree
twoeener: 1623.36354286 hartree
cpcmener: -0.02084466 hartree
kineticenergy: 812.45279296 hartree
xcener: -82.315145490925 hartree
chargesum: 0.0000000
charge: -0.290864 -0.515917 0.122197 -0.180919 -0.164729 -0.161531 0.084885 -0.148723 -0.346672 -0.320017 -0.320059 -0.144044 -0.147609 0.010884 -0.264433 -0.169319 0.479534 0.038737 -0.253598 0.055408 0.078649 0.076917 0.079729 0.080997 0.074691 0.074454 0.038243 0.095036 0.084672 0.086403 0.097830 0.095395 0.092886 0.094975 0.079147 0.078818 0.092524 0.094910 0.133356 0.114390 0.106741 0.107192 0.106716 0.115531 0.096164 0.095788 0.088139 0.087756 0.088741
qa: -0.2909 -0.5159 0.1222 -0.1809 -0.1647 -0.1615 0.0849 -0.1487 -0.3467 -0.3200 -0.3201 -0.1440 -0.1476 0.0109 -0.2644 -0.1693 0.4795 0.0387 -0.2536 0.0554 0.0786 0.0769 0.0797 0.0810 0.0747 0.0745 0.0382 0.0950 0.0847 0.0864 0.0978 0.0954 0.0929 0.0950 0.0791 0.0788 0.0925 0.0949 0.1334 0.1144 0.1067 0.1072 0.1067 0.1155 0.0962 0.0958 0.0881 0.0878 0.0887
va: 2.1163 1.9843 3.7462 3.9003 3.8739 3.8809 3.8120 3.9427 3.9667 3.9431 3.9434 3.8881 3.9251 3.7085 3.9243 3.7765 4.1402 3.8452 3.9708 1.0181 1.0096 1.0092 0.9968 0.9926 1.0097 1.0101 1.0107 1.0013 1.0155 0.9948 1.0017 1.0026 1.0025 1.0045 0.9977 0.9985 1.0026 1.0043 0.9940 1.0232 0.9960 0.9957 1.0359 1.0325 0.9957 0.9962 1.0033 1.0033 1.0064
dispcorr: -0.018795853 hartree
energy: -816.432485396385
dipole: -28.93620 28.41920 -0.51700 22.71340 -21.54436 1.16904 -2.37464 2.00062 -0.37402
magnitude: 1.33186 au
magnitude: 3.38532 debye
