program: Orca
programVersion: 5.0.2
elementType: O O C C C C C C C C C C C C C C C C C H H H H H H H H H H H H H H H H H H H H H H H H H H H H H H
charge: 0
multiplicity: 1
keywords: wb97x-d3
keywords: def2-TZVPP
keywords: def2/J RIJCOSX
keywords: DEFGRID2
keywords: scfconv7
keywords: smallprint printgap noloewdin
keywords: NOSOSCF
formula: C17H30O2
InChI: InChI=1/C17H30O2/c1-6-19-17(18)13-16(5)12-8-11-15(4)10-7-9-14(2)3/h8,12-15H,6-7,9-11H2,1-5H3
49 atoms
O  3.411993 -0.526502 0.948118
O  3.162548 -1.482978 -1.053319
C  -4.205256 -0.19835 0.215589
C  -3.285238 0.957192 0.633179
C  -2.341006 1.455593 -0.4629
C  -1.123489 2.170512 0.109483
C  -0.198361 2.821069 -0.920043
C  -3.549519 -1.567501 0.489806
C  -5.539775 -0.13747 0.948487
C  0.946235 3.540472 -0.216262
C  0.355263 1.815716 -1.924254
C  -2.241615 -1.743242 -0.198878
C  -1.056004 -1.665769 0.415601
C  0.236769 -1.68394 -0.261304
C  0.250096 -2.035683 -1.714603
C  1.307816 -1.304854 0.470871
C  2.686557 -1.138988 0.010229
C  4.800437 -0.285312 0.677103
C  5.363727 0.517443 1.822215
H  -4.40346 -0.120253 -0.859844
H  -2.701788 0.642616 1.506536
H  -3.890391 1.80076 0.978721
H  -2.888283 2.128073 -1.132216
H  -2.014669 0.61969 -1.084627
H  -1.460005 2.940508 0.812852
H  -0.543529 1.453834 0.705595
H  -0.781298 3.567249 -1.473473
H  -4.238404 -2.352991 0.164027
H  -3.42069 -1.677997 1.5708
H  -6.071659 0.788141 0.723042
H  -6.189929 -0.96929 0.671173
H  -5.395358 -0.178733 2.030815
H  1.593778 4.055861 -0.928045
H  1.567352 2.8334 0.3401
H  0.577931 4.284523 0.492825
H  1.029635 2.300685 -2.632797
H  0.923697 1.02971 -1.419222
H  -0.431472 1.334505 -2.50643
H  -2.284838 -1.886198 -1.274585
H  -1.034141 -1.501303 1.489354
H  -0.303801 -2.95897 -1.887215
H  1.246977 -2.156844 -2.118409
H  -0.25379 -1.255574 -2.289917
H  1.139288 -1.040128 1.508565
H  4.908991 0.259683 -0.262488
H  5.324353 -1.238366 0.575622
H  4.870349 1.484955 1.915464
H  5.275232 -0.011832 2.770764
H  6.422477 0.700842 1.641344
elementType: O C H
totalener: -816.41268305 hartree
nucrepener: 1507.43115600 hartree
electener: -2323.84383905 hartree
oneelecener: -4100.31373412 hartree
twoeener: 1776.46989507 hartree
cpcmener: -0.02073147 hartree
kineticenergy: 812.45768327 hartree
xcener: -82.316339846967 hartree
chargesum: 0.0000000
charge: -0.293848 -0.517827 0.080653 -0.196064 -0.120387 -0.199524 0.105417 -0.131665 -0.314328 -0.301935 -0.300943 -0.075829 -0.206614 0.021583 -0.268552 -0.198158 0.506403 0.036036 -0.253301 0.049805 0.070670 0.084547 0.084119 0.068037 0.084856 0.059624 0.027826 0.089653 0.081363 0.089411 0.089654 0.087524 0.090977 0.077822 0.088258 0.102593 0.044814 0.095648 0.132487 0.120772 0.115557 0.112476 0.103274 0.116455 0.092194 0.103222 0.088469 0.087833 0.088940
qa: -0.2938 -0.5178 0.0807 -0.1961 -0.1204 -0.1995 0.1054 -0.1317 -0.3143 -0.3019 -0.3009 -0.0758 -0.2066 0.0216 -0.2686 -0.1982 0.5064 0.0360 -0.2533 0.0498 0.0707 0.0845 0.0841 0.0680 0.0849 0.0596 0.0278 0.0897 0.0814 0.0894 0.0897 0.0875 0.0910 0.0778 0.0883 0.1026 0.0448 0.0956 0.1325 0.1208 0.1156 0.1125 0.1033 0.1165 0.0922 0.1032 0.0885 0.0878 0.0889
va: 2.1069 1.9788 3.7474 3.8873 3.8292 3.8976 3.7865 3.9368 3.9474 3.9371 3.9343 3.8118 3.9051 3.6318 3.9028 3.7802 4.0848 3.8429 3.9733 1.0205 1.0098 1.0064 1.0117 1.0053 1.0118 1.0078 1.0189 1.0090 1.0115 1.0036 1.0045 0.9996 1.0050 1.0047 1.0052 1.0091 1.0141 0.9981 0.9981 1.0192 1.0004 1.0351 0.9948 1.0340 0.9979 0.9961 1.0024 1.0032 1.0065
dispcorr: -0.023832366 hartree
energy: -816.436515415344
dipole: -12.54739 11.40250 -1.14488 13.81447 -13.35018 0.46429 0.08019 0.48443 0.56463
magnitude: 1.35835 au
magnitude: 3.45266 debye
