program: Orca
programVersion: 5.0.2
elementType: O O C C C C C C C C C C C C C C C C C H H H H H H H H H H H H H H H H H H H H H H H H H H H H H H
charge: 0
multiplicity: 1
keywords: wb97x-d3
keywords: def2-TZVPP
keywords: def2/J RIJCOSX
keywords: DEFGRID2
keywords: scfconv7
keywords: smallprint printgap noloewdin
keywords: NOSOSCF
formula: C17H30O2
InChI: InChI=1/C17H30O2/c1-6-19-17(18)13-16(5)12-8-11-15(4)10-7-9-14(2)3/h8,12-15H,6-7,9-11H2,1-5H3
49 atoms
O  4.014513 -0.730901 0.731642
O  3.506499 -2.316384 -0.761425
C  -4.034482 -0.533967 -0.091698
C  -3.358251 0.532972 -0.958109
C  -2.778023 1.724375 -0.2045
C  -2.075125 2.704508 -1.136311
C  -1.492913 3.940355 -0.447964
C  -3.07987 -1.147864 0.945326
C  -5.286449 -0.009086 0.601062
C  -0.395302 3.580022 0.547862
C  -0.963546 4.925328 -1.484016
C  -1.833624 -1.688617 0.335223
C  -0.602851 -1.268084 0.647671
C  0.635723 -1.760169 0.051748
C  0.520765 -2.821002 -0.994975
C  1.783878 -1.201149 0.494401
C  3.150483 -1.503297 0.067269
C  5.417964 -0.889507 0.478748
C  6.009258 -2.060655 1.230334
H  -4.341154 -1.341161 -0.766712
H  -4.085671 0.892502 -1.693662
H  -2.55754 0.063476 -1.539722
H  -2.073287 1.371206 0.552954
H  -3.569519 2.250401 0.338873
H  -1.270422 2.184392 -1.670599
H  -2.784431 3.030777 -1.904993
H  -2.303886 4.431944 0.102982
H  -3.609929 -1.96327 1.449753
H  -2.832736 -0.413749 1.716554
H  -5.806803 -0.808208 1.132214
H  -5.05011 0.766727 1.331454
H  -5.986868 0.417539 -0.11929
H  0.420765 3.047155 0.0524
H  -0.759202 2.944469 1.356111
H  0.028718 4.474424 1.008171
H  -0.15007 4.482775 -2.064502
H  -1.742992 5.226544 -2.186367
H  -0.575856 5.831005 -1.014019
H  -1.970311 -2.459492 -0.418219
H  -0.495516 -0.491549 1.400253
H  0.000544 -3.691728 -0.592605
H  1.47643 -3.147261 -1.384227
H  -0.080823 -2.457131 -1.829898
H  1.706099 -0.4352 1.257463
H  5.863208 0.043103 0.821238
H  5.604349 -0.969613 -0.593178
H  5.837279 -1.971534 2.303016
H  5.609819 -3.016152 0.893045
H  7.087398 -2.076655 1.067913
elementType: O C H
totalener: -816.41493975 hartree
nucrepener: 1435.83743662 hartree
electener: -2252.25237637 hartree
oneelecener: -3957.11152150 hartree
twoeener: 1704.85914513 hartree
cpcmener: -0.02024153 hartree
kineticenergy: 812.45968057 hartree
xcener: -82.317541464579 hartree
chargesum: -0.0000000
charge: -0.299631 -0.516303 0.088051 -0.163501 -0.150118 -0.159037 0.084962 -0.148654 -0.334493 -0.309507 -0.301009 -0.111612 -0.171459 0.021585 -0.263808 -0.185493 0.492608 0.038428 -0.254779 0.055685 0.085605 0.078611 0.056822 0.077458 0.065767 0.069240 0.024781 0.099235 0.082619 0.095184 0.084468 0.094301 0.082028 0.090860 0.092668 0.081240 0.088087 0.089778 0.130570 0.115981 0.107011 0.105963 0.107929 0.115363 0.108812 0.087167 0.088170 0.086573 0.095795
qa: -0.2996 -0.5163 0.0881 -0.1635 -0.1501 -0.1590 0.0850 -0.1487 -0.3345 -0.3095 -0.3010 -0.1116 -0.1715 0.0216 -0.2638 -0.1855 0.4926 0.0384 -0.2548 0.0557 0.0856 0.0786 0.0568 0.0775 0.0658 0.0692 0.0248 0.0992 0.0826 0.0952 0.0845 0.0943 0.0820 0.0909 0.0927 0.0812 0.0881 0.0898 0.1306 0.1160 0.1070 0.1060 0.1079 0.1154 0.1088 0.0872 0.0882 0.0866 0.0958
va: 2.1130 1.9781 3.7865 3.8923 3.8700 3.8781 3.8055 3.9247 3.9503 3.9274 3.9308 3.8474 3.9027 3.6892 3.9188 3.7697 4.1422 3.8490 3.9145 1.0134 1.0088 1.0070 1.0044 1.0093 1.0128 1.0125 1.0186 1.0063 1.0042 1.0034 0.9967 1.0031 1.0031 1.0007 1.0051 1.0027 1.0046 1.0051 1.0004 1.0208 0.9961 1.0356 0.9960 1.0342 0.9958 1.0121 1.0042 1.0146 1.0069
dispcorr: -0.020393158 hartree
energy: -816.435332903336
dipole: -17.27804 16.23003 -1.04801 15.38921 -14.92450 0.46472 -0.88056 1.46525 0.58470
magnitude: 1.28692 au
magnitude: 3.27109 debye
