program: Orca
programVersion: 5.0.2
elementType: O O C C C C C C C C C C C C C C C C C H H H H H H H H H H H H H H H H H H H H H H H H H H H H H H
charge: 0
multiplicity: 1
keywords: wb97x-d3
keywords: def2-TZVPP
keywords: def2/J RIJCOSX
keywords: DEFGRID2
keywords: scfconv7
keywords: smallprint printgap noloewdin
keywords: NOSOSCF
formula: C17H30O2
InChI: InChI=1/C17H30O2/c1-6-19-17(18)13-16(5)12-8-11-15(4)10-7-9-14(2)3/h8,12-15H,6-7,9-11H2,1-5H3
49 atoms
O  3.453961 -0.612211 0.952615
O  3.147812 -1.387474 -1.118369
C  -4.202999 -0.216866 0.219356
C  -3.299577 0.95176 0.63738
C  -2.35774 1.459226 -0.455908
C  -1.15961 2.20448 0.118051
C  -0.241308 2.864106 -0.911676
C  -3.532729 -1.575797 0.507426
C  -5.546181 -0.16503 0.936832
C  0.882627 3.615889 -0.208448
C  0.338718 1.859789 -1.902081
C  -2.228974 -1.749939 -0.189503
C  -1.038449 -1.664134 0.414255
C  0.248209 -1.677027 -0.274256
C  0.252394 -2.031981 -1.726943
C  1.324715 -1.299266 0.450944
C  2.698675 -1.1264 -0.01977
C  4.837518 -0.356279 0.669626
C  5.442157 0.30383 1.882682
H  -4.390698 -0.148262 -0.858644
H  -2.714921 0.646983 1.513437
H  -3.916391 1.788614 0.978631
H  -2.913696 2.113202 -1.136268
H  -2.009566 0.623694 -1.066089
H  -1.517273 2.974164 0.811296
H  -0.569225 1.505758 0.725207
H  -0.836413 3.59194 -1.476482
H  -4.216098 -2.372225 0.196846
H  -3.395279 -1.670912 1.588796
H  -5.413951 -0.200136 2.020874
H  -6.083812 0.754686 0.700984
H  -6.185301 -1.004005 0.655476
H  1.513231 2.928632 0.361668
H  0.493624 4.361048 0.488368
H  1.525457 4.135313 -0.921553
H  0.92661 1.09518 -1.386467
H  -0.434553 1.35069 -2.478507
H  1.001081 2.352611 -2.616433
H  -2.280633 -1.895254 -1.264586
H  -1.00789 -1.491631 1.486531
H  -0.225935 -1.238398 -2.305957
H  -0.328767 -2.938423 -1.897943
H  1.246308 -2.184561 -2.127908
H  1.165262 -1.048366 1.493409
H  4.924551 0.291441 -0.204918
H  5.346536 -1.296031 0.444578
H  4.959991 1.256154 2.10425
H  5.37841 -0.33296 2.765033
H  6.496405 0.502256 1.691677
elementType: O C H
totalener: -816.41295086 hartree
nucrepener: 1503.51242359 hartree
electener: -2319.92537444 hartree
oneelecener: -4092.50140277 hartree
twoeener: 1772.57602833 hartree
cpcmener: -0.02081070 hartree
kineticenergy: 812.45689576 hartree
xcener: -82.315903531486 hartree
chargesum: -0.0000000
charge: -0.293611 -0.519530 0.079380 -0.195737 -0.119283 -0.199623 0.106560 -0.129995 -0.313290 -0.302329 -0.303064 -0.077561 -0.203734 0.019904 -0.269137 -0.193880 0.505316 0.036231 -0.253847 0.049534 0.070429 0.084356 0.083633 0.067071 0.084170 0.059534 0.027573 0.089481 0.081220 0.087530 0.089504 0.089578 0.079275 0.088298 0.090794 0.046486 0.095555 0.102569 0.132288 0.120076 0.106060 0.114101 0.112269 0.115614 0.093847 0.100944 0.088522 0.088038 0.088882
qa: -0.2936 -0.5195 0.0794 -0.1957 -0.1193 -0.1996 0.1066 -0.1300 -0.3133 -0.3023 -0.3031 -0.0776 -0.2037 0.0199 -0.2691 -0.1939 0.5053 0.0362 -0.2538 0.0495 0.0704 0.0844 0.0836 0.0671 0.0842 0.0595 0.0276 0.0895 0.0812 0.0875 0.0895 0.0896 0.0793 0.0883 0.0908 0.0465 0.0956 0.1026 0.1323 0.1201 0.1061 0.1141 0.1123 0.1156 0.0938 0.1009 0.0885 0.0880 0.0889
va: 2.1105 1.9758 3.7467 3.8884 3.8285 3.8975 3.7843 3.9365 3.9470 3.9368 3.9345 3.8159 3.9034 3.6327 3.9054 3.7725 4.0921 3.8440 3.9726 1.0207 1.0097 1.0065 1.0120 1.0059 1.0119 1.0082 1.0190 1.0088 1.0119 0.9996 1.0035 1.0045 1.0035 1.0051 1.0050 1.0145 0.9981 1.0092 0.9984 1.0198 0.9947 1.0002 1.0337 1.0341 0.9970 0.9960 1.0026 1.0031 1.0065
dispcorr: -0.023615753 hartree
energy: -816.436566609784
dipole: -12.63630 11.50451 -1.13179 13.59742 -13.21756 0.37986 0.32730 0.27631 0.60361
magnitude: 1.33775 au
magnitude: 3.40030 debye
