program: Orca
programVersion: 5.0.2
elementType: O O C C C C C C C C C C C C C C C C C H H H H H H H H H H H H H H H H H H H H H H H H H H H H H H
charge: 0
multiplicity: 1
keywords: wb97x-d3
keywords: def2-TZVPP
keywords: def2/J RIJCOSX
keywords: DEFGRID2
keywords: scfconv7
keywords: smallprint printgap noloewdin
keywords: NOSOSCF
formula: C17H30O2
InChI: InChI=1/C17H30O2/c1-6-19-17(18)13-16(5)12-8-11-15(4)10-7-9-14(2)3/h8,12-15H,6-7,9-11H2,1-5H3
49 atoms
O  3.991418 -1.917348 1.324662
O  3.766133 -1.320195 -0.819625
C  -3.763403 0.00761 0.184532
C  -3.096484 1.096997 1.028925
C  -3.387209 2.528211 0.581593
C  -2.917689 2.865478 -0.834828
C  -1.452401 2.550228 -1.14152
C  -3.04455 -1.341595 0.353254
C  -5.241941 -0.129017 0.525157
C  -1.133778 2.881728 -2.594555
C  -0.498686 3.281435 -0.204803
C  -1.693978 -1.322945 -0.274887
C  -0.539027 -1.468055 0.383418
C  0.788049 -1.388122 -0.22192
C  0.860925 -1.062019 -1.679453
C  1.84111 -1.610286 0.595705
C  3.264319 -1.586794 0.253839
C  5.421454 -1.946432 1.209612
C  6.035598 -0.572629 1.351724
H  -3.685378 0.279861 -0.874248
H  -2.013425 0.945814 1.038927
H  -3.417239 0.975026 2.069375
H  -2.918439 3.212537 1.294257
H  -4.460472 2.73084 0.647585
H  -3.545351 2.341243 -1.562454
H  -3.091114 3.93275 -1.013836
H  -1.295169 1.473149 -1.010012
H  -3.646514 -2.118644 -0.130171
H  -2.976923 -1.602158 1.413756
H  -5.37608 -0.468944 1.554942
H  -5.767768 0.821699 0.42258
H  -5.737532 -0.848406 -0.129154
H  -1.783233 2.334756 -3.280861
H  -0.101981 2.626855 -2.844804
H  -1.266665 3.947903 -2.795362
H  -0.645397 2.998293 0.838717
H  0.54172 3.064206 -0.45437
H  -0.634026 4.364038 -0.274876
H  -1.685544 -1.141747 -1.346027
H  -0.567848 -1.650759 1.453991
H  0.372819 -0.104334 -1.873819
H  0.319994 -1.810535 -2.261076
H  1.873178 -1.007993 -2.058243
H  1.62845 -1.840659 1.633294
H  5.71779 -2.419444 0.27247
H  5.747223 -2.592952 2.022913
H  5.751264 0.095473 0.539761
H  5.755572 -0.108879 2.297634
H  7.121724 -0.667503 1.338017
elementType: O C H
totalener: -816.41347176 hartree
nucrepener: 1464.43042861 hartree
electener: -2280.84390037 hartree
oneelecener: -4014.13707167 hartree
twoeener: 1733.29317131 hartree
cpcmener: -0.02023285 hartree
kineticenergy: 812.45121165 hartree
xcener: -82.318074276509 hartree
chargesum: 0.0000000
charge: -0.298861 -0.516123 0.043843 -0.157413 -0.181224 -0.184462 0.136178 -0.117173 -0.305939 -0.306065 -0.309344 -0.115574 -0.171705 0.023434 -0.258062 -0.182659 0.490190 0.038814 -0.256257 0.052016 0.077709 0.083615 0.082024 0.078799 0.079375 0.080446 -0.039695 0.093598 0.081976 0.082266 0.093281 0.091964 0.091126 0.089783 0.089387 0.089036 0.093546 0.090264 0.123945 0.119024 0.101772 0.109525 0.109436 0.116090 0.087397 0.108975 0.087062 0.088655 0.096007
qa: -0.2989 -0.5161 0.0438 -0.1574 -0.1812 -0.1845 0.1362 -0.1172 -0.3059 -0.3061 -0.3093 -0.1156 -0.1717 0.0234 -0.2581 -0.1827 0.4902 0.0388 -0.2563 0.0520 0.0777 0.0836 0.0820 0.0788 0.0794 0.0804 -0.0397 0.0936 0.0820 0.0823 0.0933 0.0920 0.0911 0.0898 0.0894 0.0890 0.0935 0.0903 0.1239 0.1190 0.1018 0.1095 0.1094 0.1161 0.0874 0.1090 0.0871 0.0887 0.0960
va: 2.1137 1.9787 3.7532 3.8632 3.9233 3.8955 3.7650 3.9185 3.9480 3.9207 3.9317 3.8508 3.8698 3.6908 3.9207 3.7778 4.1439 3.8469 3.9165 1.0214 1.0012 1.0120 1.0016 1.0086 1.0019 1.0114 1.0417 1.0051 1.0151 1.0022 1.0027 1.0044 1.0034 1.0046 1.0052 1.0012 1.0048 1.0029 1.0010 1.0212 0.9896 0.9959 1.0368 1.0333 1.0123 0.9955 1.0140 1.0040 1.0069
dispcorr: -0.022428107 hartree
energy: -816.435899863521
dipole: -18.59452 17.52529 -1.06923 16.66393 -16.72942 -0.06548 -2.78584 3.39324 0.60741
magnitude: 1.23145 au
magnitude: 3.13011 debye
