program: Orca
programVersion: 5.0.2
elementType: O O C C C C C C C C C C C C C C C C C H H H H H H H H H H H H H H H H H H H H H H H H H H H H H H
charge: 0
multiplicity: 1
keywords: wb97x-d3
keywords: def2-TZVPP
keywords: def2/J RIJCOSX
keywords: DEFGRID2
keywords: scfconv7
keywords: smallprint printgap noloewdin
keywords: NOSOSCF
formula: C17H30O2
InChI: InChI=1/C17H30O2/c1-6-19-17(18)13-16(5)12-8-11-15(4)10-7-9-14(2)3/h8,12-15H,6-7,9-11H2,1-5H3
49 atoms
O  3.977912 -0.674438 0.706386
O  3.480876 -2.274949 -0.774192
C  -4.052156 -0.53697 -0.096959
C  -3.357806 0.523903 -0.956354
C  -2.767161 1.706425 -0.196498
C  -2.022182 2.664255 -1.118642
C  -1.412413 3.883168 -0.423928
C  -3.111024 -1.162157 0.946437
C  -5.303666 -0.000097 0.586929
C  -0.329381 3.492243 0.576281
C  -0.852382 4.856554 -1.454785
C  -1.860659 -1.700591 0.342788
C  -0.632547 -1.273275 0.656423
C  0.608542 -1.752481 0.055341
C  0.500054 -2.818582 -0.986623
C  1.752282 -1.177541 0.489047
C  3.119918 -1.463783 0.054299
C  5.381573 -0.817022 0.445325
C  5.991004 -1.975291 1.20228
H  -4.361719 -1.340032 -0.775537
H  -4.075504 0.893801 -1.696296
H  -2.559118 0.045679 -1.533591
H  -2.086851 1.342147 0.577813
H  -3.557987 2.253109 0.327032
H  -1.225649 2.119473 -1.640446
H  -2.710249 3.009827 -1.898214
H  -2.213286 4.394167 0.124151
H  -3.649283 -1.979155 1.439203
H  -2.869332 -0.43407 1.725024
H  -5.835934 -0.794199 1.113834
H  -5.064466 0.773063 1.319245
H  -5.994469 0.43383 -0.13836
H  0.475637 2.940554 0.083218
H  -0.712985 2.863162 1.380549
H  0.114646 4.374153 1.041771
H  -0.049092 4.393688 -2.033588
H  -1.620691 5.180934 -2.159067
H  -0.441961 5.749849 -0.980411
H  -1.992081 -2.471736 -0.411227
H  -0.530034 -0.496736 1.409653
H  -0.100371 -2.459918 -1.824672
H  -0.018616 -3.689096 -0.581956
H  1.457553 -3.143637 -1.372107
H  1.669503 -0.410062 1.25003
H  5.817458 0.123642 0.777818
H  5.56211 -0.903497 -0.627097
H  5.595732 -2.937472 0.87921
H  7.067401 -1.984325 1.028154
H  5.829839 -1.876563 2.275812
elementType: O C H
totalener: -816.41480136 hartree
nucrepener: 1440.09564349 hartree
electener: -2256.51044485 hartree
oneelecener: -3965.63046908 hartree
twoeener: 1709.12002423 hartree
cpcmener: -0.02025760 hartree
kineticenergy: 812.46014282 hartree
xcener: -82.317723114635 hartree
chargesum: -0.0000000
charge: -0.299793 -0.516437 0.086895 -0.162665 -0.151001 -0.158691 0.085147 -0.147682 -0.334596 -0.310481 -0.300348 -0.111052 -0.174224 0.024777 -0.263997 -0.187245 0.493249 0.038831 -0.255099 0.055784 0.086151 0.078046 0.056632 0.077809 0.065416 0.069751 0.024431 0.099114 0.082243 0.095203 0.084538 0.094190 0.081830 0.091264 0.093105 0.081293 0.088033 0.089541 0.130730 0.116373 0.108303 0.106834 0.105852 0.115301 0.108936 0.087089 0.086685 0.095689 0.088244
qa: -0.2998 -0.5164 0.0869 -0.1627 -0.1510 -0.1587 0.0851 -0.1477 -0.3346 -0.3105 -0.3003 -0.1111 -0.1742 0.0248 -0.2640 -0.1872 0.4932 0.0388 -0.2551 0.0558 0.0862 0.0780 0.0566 0.0778 0.0654 0.0698 0.0244 0.0991 0.0822 0.0952 0.0845 0.0942 0.0818 0.0913 0.0931 0.0813 0.0880 0.0895 0.1307 0.1164 0.1083 0.1068 0.1059 0.1153 0.1089 0.0871 0.0867 0.0957 0.0882
va: 2.1131 1.9779 3.7885 3.8905 3.8693 3.8776 3.8052 3.9253 3.9506 3.9277 3.9299 3.8459 3.9035 3.6824 3.9190 3.7694 4.1418 3.8482 3.9148 1.0134 1.0087 1.0072 1.0049 1.0096 1.0130 1.0124 1.0186 1.0066 1.0044 1.0034 0.9966 1.0031 1.0031 1.0007 1.0052 1.0026 1.0046 1.0053 1.0002 1.0205 0.9959 0.9962 1.0356 1.0342 0.9959 1.0122 1.0146 1.0069 1.0042
dispcorr: -0.020555993 hartree
energy: -816.435357349683
dipole: -16.94065 15.88871 -1.05194 15.11694 -14.65394 0.46300 -0.80553 1.38600 0.58047
magnitude: 1.28760 au
magnitude: 3.27281 debye
