program: Orca
programVersion: 5.0.2
elementType: O O C C C C C C C C C C C C C C C C C H H H H H H H H H H H H H H H H H H H H H H H H H H H H H H
charge: 0
multiplicity: 1
keywords: wb97x-d3
keywords: def2-TZVPP
keywords: def2/J RIJCOSX
keywords: DEFGRID2
keywords: scfconv7
keywords: smallprint printgap noloewdin
keywords: NOSOSCF
formula: C17H30O2
InChI: InChI=1/C17H30O2/c1-6-19-17(18)13-16(5)12-8-11-15(4)10-7-9-14(2)3/h8,12-15H,6-7,9-11H2,1-5H3
49 atoms
O  3.65634 -0.916319 0.999274
O  3.25237 -1.329315 -1.156726
C  -4.206759 -0.290836 0.245361
C  -3.416007 0.973336 0.606117
C  -2.515999 1.504785 -0.507551
C  -1.483446 2.494994 0.01291
C  -0.588882 3.1205 -1.057437
C  -3.415075 -1.570126 0.580221
C  -5.544581 -0.329099 0.97413
C  0.310033 4.18558 -0.439594
C  0.253354 2.075469 -1.781525
C  -2.117812 -1.676881 -0.142005
C  -0.916771 -1.570904 0.437842
C  0.357425 -1.576775 -0.274867
C  0.324324 -1.855411 -1.743601
C  1.461907 -1.29788 0.453256
C  2.842573 -1.196252 -0.020537
C  5.05914 -0.783224 0.727278
C  5.751224 -0.447342 2.023839
H  -4.40715 -0.284021 -0.832681
H  -2.814388 0.770554 1.500436
H  -4.109896 1.768206 0.896795
H  -3.13546 1.981896 -1.274485
H  -2.009989 0.675736 -1.005376
H  -1.998367 3.295018 0.556787
H  -0.848256 1.989159 0.751337
H  -1.235365 3.608809 -1.79666
H  -4.034366 -2.435319 0.321291
H  -3.247928 -1.606487 1.660984
H  -6.110931 -1.229926 0.730482
H  -5.403055 -0.311783 2.05757
H  -6.160981 0.531573 0.709989
H  0.981185 3.7488 0.304374
H  -0.27329 4.961486 0.060085
H  0.930359 4.673759 -1.193551
H  0.922679 2.543024 -2.506373
H  0.873578 1.514677 -1.07592
H  -0.359002 1.356111 -2.326797
H  -2.187364 -1.812424 -1.21744
H  -0.865481 -1.420486 1.512594
H  1.307478 -1.947167 -2.186938
H  -0.208035 -1.05578 -2.26369
H  -0.226368 -2.776164 -1.940623
H  1.330609 -1.115383 1.513624
H  5.219808 0.004051 -0.012096
H  5.444776 -1.71739 0.31347
H  5.618317 -1.231978 2.768873
H  6.820143 -0.343524 1.839266
H  5.392935 0.493968 2.440687
elementType: O C H
totalener: -816.41391081 hartree
nucrepener: 1478.49981669 hartree
electener: -2294.91372749 hartree
oneelecener: -4042.50010523 hartree
twoeener: 1747.58637773 hartree
cpcmener: -0.02108986 hartree
kineticenergy: 812.45691167 hartree
xcener: -82.315372699391 hartree
chargesum: 0.0000000
charge: -0.292193 -0.518405 0.082673 -0.191620 -0.125513 -0.177505 0.101428 -0.131344 -0.312209 -0.300099 -0.323909 -0.079159 -0.193754 0.002780 -0.264706 -0.178101 0.495739 0.039727 -0.253184 0.047615 0.069283 0.082968 0.079084 0.061971 0.077115 0.062171 0.026685 0.091015 0.080795 0.089552 0.087611 0.089329 0.081498 0.088217 0.090221 0.099940 0.071099 0.095520 0.132612 0.117198 0.110384 0.104054 0.113800 0.114834 0.094608 0.095869 0.087771 0.088452 0.088080
qa: -0.2922 -0.5184 0.0827 -0.1916 -0.1255 -0.1775 0.1014 -0.1313 -0.3122 -0.3001 -0.3239 -0.0792 -0.1938 0.0028 -0.2647 -0.1781 0.4957 0.0397 -0.2532 0.0476 0.0693 0.0830 0.0791 0.0620 0.0771 0.0622 0.0267 0.0910 0.0808 0.0896 0.0876 0.0893 0.0815 0.0882 0.0902 0.0999 0.0711 0.0955 0.1326 0.1172 0.1104 0.1041 0.1138 0.1148 0.0946 0.0959 0.0878 0.0885 0.0881
va: 2.1171 1.9768 3.7433 3.8960 3.8454 3.8829 3.7930 3.9391 3.9445 3.9325 3.9437 3.8325 3.8959 3.6627 3.9081 3.7606 4.1184 3.8446 3.9707 1.0212 1.0094 1.0067 1.0142 1.0098 1.0114 1.0121 1.0190 1.0076 1.0124 1.0044 0.9996 1.0037 1.0018 1.0049 1.0054 1.0077 1.0042 0.9958 0.9980 1.0219 1.0349 0.9955 0.9988 1.0335 0.9963 0.9957 1.0033 1.0067 1.0032
dispcorr: -0.022391301 hartree
energy: -816.436302109728
dipole: -13.92400 12.81746 -1.10653 13.69595 -13.53696 0.15899 0.39935 0.25289 0.65224
magnitude: 1.29426 au
magnitude: 3.28975 debye
