program: Orca
programVersion: 5.0.2
elementType: O O C C C C C C C C C C C C C C C C C H H H H H H H H H H H H H H H H H H H H H H H H H H H H H H
charge: 0
multiplicity: 1
keywords: wb97x-d3
keywords: def2-TZVPP
keywords: def2/J RIJCOSX
keywords: DEFGRID2
keywords: scfconv7
keywords: smallprint printgap noloewdin
keywords: NOSOSCF
formula: C17H30O2
InChI: InChI=1/C17H30O2/c1-6-19-17(18)13-16(5)12-8-11-15(4)10-7-9-14(2)3/h8,12-15H,6-7,9-11H2,1-5H3
49 atoms
O  3.484078 -2.115134 -0.791824
O  3.857896 -1.403442 1.288934
C  -3.281654 -0.752908 -1.087285
C  -2.544226 0.547206 -1.424065
C  -2.714428 1.686019 -0.424596
C  -1.89842 2.913421 -0.815121
C  -2.014676 4.101863 0.141455
C  -2.845668 -1.352594 0.261181
C  -4.796574 -0.585554 -1.115839
C  -1.448246 3.786397 1.521973
C  -1.320629 5.325029 -0.447743
C  -1.3704 -1.541318 0.361268
C  -0.597771 -0.924005 1.259387
C  0.858821 -1.041576 1.408863
C  1.341109 -0.621577 2.761804
C  1.628243 -1.458835 0.383593
C  3.081841 -1.640711 0.388295
C  4.884355 -2.349617 -0.983265
C  5.075615 -2.869215 -2.386112
H  -3.014314 -1.476551 -1.866313
H  -2.875368 0.885115 -2.412089
H  -1.475596 0.331458 -1.529974
H  -2.415697 1.347612 0.570898
H  -3.769846 1.966686 -0.346346
H  -0.841326 2.632983 -0.902066
H  -2.206344 3.235485 -1.816365
H  -3.079156 4.34074 0.256319
H  -3.339005 -2.324189 0.375213
H  -3.199672 -0.727096 1.085173
H  -5.149598 0.07591 -0.322109
H  -5.130825 -0.165397 -2.066556
H  -5.302698 -1.544314 -0.985537
H  -1.518716 4.65123 2.184937
H  -0.392469 3.50853 1.457124
H  -1.974042 2.965201 2.011427
H  -0.252964 5.140028 -0.59283
H  -1.741336 5.596381 -1.418197
H  -1.415685 6.194849 0.205498
H  -0.927649 -2.226003 -0.358493
H  -1.081902 -0.282014 1.99137
H  0.791949 -1.163516 3.534866
H  1.111098 0.436875 2.910991
H  2.401707 -0.765836 2.923848
H  1.149476 -1.685738 -0.561608
H  5.243509 -3.075392 -0.249751
H  5.441252 -1.421411 -0.834889
H  4.545669 -3.808865 -2.545724
H  4.738534 -2.149423 -3.132782
H  6.13624 -3.053448 -2.558202
elementType: O C H
totalener: -816.42573781 hartree
nucrepener: 1434.28109714 hartree
electener: -2250.70683495 hartree
oneelecener: -3953.89134049 hartree
twoeener: 1703.18450554 hartree
cpcmener: -0.01720870 hartree
kineticenergy: 812.43705236 hartree
xcener: -82.309582594016 hartree
chargesum: 0.0000000
charge: -0.288717 -0.487682 0.075455 -0.155127 -0.151235 -0.158517 0.083937 -0.141174 -0.329828 -0.307786 -0.296147 -0.107819 -0.175138 0.034038 -0.248907 -0.196494 0.467716 0.042379 -0.251676 0.055566 0.084859 0.077233 0.054539 0.078198 0.066409 0.069412 0.023773 0.098847 0.081519 0.083644 0.094203 0.094990 0.092490 0.082605 0.089114 0.080787 0.087121 0.089001 0.121653 0.114615 0.107358 0.104814 0.104021 0.110749 0.091846 0.092287 0.086960 0.086871 0.087234
qa: -0.2887 -0.4877 0.0755 -0.1551 -0.1512 -0.1585 0.0839 -0.1412 -0.3298 -0.3078 -0.2961 -0.1078 -0.1751 0.0340 -0.2489 -0.1965 0.4677 0.0424 -0.2517 0.0556 0.0849 0.0772 0.0545 0.0782 0.0664 0.0694 0.0238 0.0988 0.0815 0.0836 0.0942 0.0950 0.0925 0.0826 0.0891 0.0808 0.0871 0.0890 0.1217 0.1146 0.1074 0.1048 0.1040 0.1107 0.0918 0.0923 0.0870 0.0869 0.0872
va: 2.1146 2.0172 3.8053 3.8980 3.8672 3.8816 3.8089 3.9198 3.9529 3.9292 3.9300 3.8474 3.8755 3.7321 3.9213 3.7893 4.1734 3.8501 3.9698 1.0127 1.0091 1.0055 1.0070 1.0098 1.0127 1.0123 1.0188 1.0068 1.0043 0.9971 1.0031 1.0038 1.0055 1.0029 1.0009 1.0031 1.0048 1.0052 1.0091 1.0105 0.9984 0.9964 1.0339 1.0354 0.9964 0.9970 1.0035 1.0034 1.0070
dispcorr: -0.020170806 hartree
energy: -816.445908619747
dipole: -18.45238 17.26343 -1.18894 16.31120 -16.48149 -0.17030 -4.73588 4.00815 -0.72772
magnitude: 1.40434 au
magnitude: 3.56955 debye
