program: Orca
programVersion: 5.0.2
elementType: O O C C C C C C C C C C C C C C C C C H H H H H H H H H H H H H H H H H H H H H H H H H H H H H H
charge: 0
multiplicity: 1
keywords: wb97x-d3
keywords: def2-TZVPP
keywords: def2/J RIJCOSX
keywords: DEFGRID2
keywords: scfconv7
keywords: smallprint printgap noloewdin
keywords: NOSOSCF
formula: C17H30O2
InChI: InChI=1/C17H30O2/c1-6-19-17(18)13-16(5)12-8-11-15(4)10-7-9-14(2)3/h8,12-15H,6-7,9-11H2,1-5H3
49 atoms
O  3.474299 -2.077011 -0.807637
O  3.838488 -1.428923 1.295602
C  -3.292076 -0.74949 -1.098362
C  -2.549432 0.549283 -1.428177
C  -2.705846 1.679046 -0.416473
C  -1.888794 2.906867 -0.803283
C  -1.969052 4.076365 0.17981
C  -2.859189 -1.356969 0.247613
C  -4.806276 -0.575904 -1.127484
C  -1.362115 3.729305 1.535396
C  -1.284596 5.306631 -0.405868
C  -1.384351 -1.547402 0.351996
C  -0.614627 -0.938581 1.258373
C  0.841081 -1.061322 1.410853
C  1.318626 -0.678249 2.776333
C  1.613569 -1.452493 0.377646
C  3.066945 -1.636698 0.383746
C  4.875723 -2.302227 -1.001458
C  5.073442 -2.774184 -2.420121
H  -3.026992 -1.470573 -1.880506
H  -2.884583 0.898147 -2.411083
H  -1.482673 0.328411 -1.542529
H  -2.398084 1.329342 0.572215
H  -3.759271 1.962885 -0.324262
H  -0.83672 2.61907 -0.921835
H  -2.218295 3.251271 -1.79012
H  -3.027823 4.319398 0.332267
H  -3.353021 -2.3291 0.3547
H  -3.215608 -0.736233 1.074188
H  -5.1380 -0.15299 -2.077854
H  -5.316615 -1.532671 -0.998828
H  -5.15692 0.086039 -0.333095
H  -0.310408 3.447496 1.43208
H  -1.877014 2.900771 2.024147
H  -1.406867 4.58048 2.218044
H  -0.224092 5.116097 -0.590938
H  -1.735332 5.602405 -1.355477
H  -1.349878 6.162648 0.268921
H  -0.93858 -2.22633 -0.371369
H  -1.09983 -0.301621 1.994071
H  1.087896 0.375904 2.952651
H  2.378828 -0.82638 2.937207
H  0.7675 -1.240663 3.533251
H  1.138085 -1.651197 -0.575475
H  5.233854 -3.0505 -0.290464
H  5.429525 -1.377805 -0.820927
H  4.736042 -2.031396 -3.14381
H  6.135441 -2.948362 -2.594529
H  4.547892 -3.710097 -2.612581
elementType: O C H
totalener: -816.42573633 hartree
nucrepener: 1435.90830779 hartree
electener: -2252.33404412 hartree
oneelecener: -3957.14722094 hartree
twoeener: 1704.81317682 hartree
cpcmener: -0.01719464 hartree
kineticenergy: 812.43783046 hartree
xcener: -82.309760069785 hartree
chargesum: -0.0000000
charge: -0.288636 -0.487761 0.074643 -0.153744 -0.151504 -0.159298 0.084828 -0.140255 -0.329408 -0.307586 -0.296394 -0.109556 -0.174266 0.035638 -0.249062 -0.198423 0.468220 0.042550 -0.251340 0.055430 0.084753 0.076863 0.053974 0.078545 0.066359 0.069677 0.023477 0.098815 0.081290 0.094079 0.094845 0.083604 0.082648 0.088610 0.092652 0.080799 0.087311 0.088990 0.121836 0.114803 0.104560 0.104022 0.107520 0.110897 0.091928 0.092141 0.086798 0.087234 0.086895
qa: -0.2886 -0.4878 0.0746 -0.1537 -0.1515 -0.1593 0.0848 -0.1403 -0.3294 -0.3076 -0.2964 -0.1096 -0.1743 0.0356 -0.2491 -0.1984 0.4682 0.0426 -0.2513 0.0554 0.0848 0.0769 0.0540 0.0785 0.0664 0.0697 0.0235 0.0988 0.0813 0.0941 0.0948 0.0836 0.0826 0.0886 0.0927 0.0808 0.0873 0.0890 0.1218 0.1148 0.1046 0.1040 0.1075 0.1109 0.0919 0.0921 0.0868 0.0872 0.0869
va: 2.1149 2.0171 3.8066 3.8977 3.8664 3.8827 3.8091 3.9182 3.9528 3.9295 3.9293 3.8476 3.8735 3.7308 3.9212 3.7914 4.1724 3.8501 3.9699 1.0127 1.0090 1.0057 1.0076 1.0100 1.0127 1.0123 1.0187 1.0067 1.0043 1.0032 1.0038 0.9973 1.0029 1.0011 1.0056 1.0031 1.0048 1.0052 1.0090 1.0105 0.9965 1.0340 0.9986 1.0351 0.9964 0.9970 1.0034 1.0069 1.0035
dispcorr: -0.020230294 hartree
energy: -816.445966626978
dipole: -18.24656 17.06750 -1.17906 16.31323 -16.45826 -0.14503 -4.70004 3.96496 -0.73509
magnitude: 1.39699 au
magnitude: 3.55086 debye
