program: Orca
programVersion: 5.0.2
elementType: O O C C C C C C C C C C C C C C C C C H H H H H H H H H H H H H H H H H H H H H H H H H H H H H H
charge: 0
multiplicity: 1
keywords: wb97x-d3
keywords: def2-TZVPP
keywords: def2/J RIJCOSX
keywords: DEFGRID2
keywords: scfconv7
keywords: smallprint printgap noloewdin
keywords: NOSOSCF
formula: C17H30O2
InChI: InChI=1/C17H30O2/c1-6-19-17(18)13-16(5)12-8-11-15(4)10-7-9-14(2)3/h8,12-15H,6-7,9-11H2,1-5H3
49 atoms
O  4.034598 -1.396938 1.42079
O  3.817276 -0.973285 -0.763554
C  -3.771862 -0.082955 0.136668
C  -3.178359 1.027423 1.009004
C  -3.515019 2.448985 0.563741
C  -2.991107 2.830778 -0.821961
C  -1.493991 2.613443 -1.052745
C  -2.99766 -1.400393 0.318637
C  -5.253304 -0.285198 0.428957
C  -1.117894 2.994878 -2.480063
C  -0.636643 3.378837 -0.052257
C  -1.643484 -1.327708 -0.299342
C  -0.489644 -1.378312 0.374435
C  0.840126 -1.238187 -0.214727
C  0.923779 -1.010954 -1.690282
C  1.887964 -1.318318 0.633552
C  3.314209 -1.209141 0.313371
C  5.463725 -1.368639 1.331984
C  6.029588 -2.688973 0.860193
H  -3.67444 0.201845 -0.917353
H  -2.090743 0.920845 1.053498
H  -3.52662 0.883725 2.038051
H  -3.118675 3.146092 1.307557
H  -4.59915 2.598228 0.576977
H  -3.543951 2.276879 -1.587678
H  -3.22467 3.886773 -1.000824
H  -1.277384 1.545289 -0.932158
H  -3.561389 -2.207713 -0.161589
H  -2.926996 -1.649931 1.381845
H  -5.698944 -1.016562 -0.248187
H  -5.408393 -0.641779 1.450457
H  -5.815666 0.643705 0.318009
H  -1.687043 2.418883 -3.21299
H  -0.058364 2.816987 -2.676095
H  -1.312238 4.053346 -2.672295
H  0.426701 3.218735 -0.242177
H  -0.822819 4.454539 -0.114994
H  -0.827209 3.072594 0.977737
H  -1.633675 -1.187654 -1.376796
H  -0.522348 -1.518466 1.451549
H  1.940694 -0.926906 -2.052723
H  0.39096 -0.096047 -1.960018
H  0.436373 -1.826135 -2.228383
H  1.672898 -1.492807 1.681733
H  5.796744 -1.154591 2.347048
H  5.792584 -0.545076 0.695781
H  5.699742 -3.511361 1.495965
H  5.752813 -2.91402 -0.16938
H  7.118586 -2.648916 0.909391
elementType: O C H
totalener: -816.42670206 hartree
nucrepener: 1462.96192068 hartree
electener: -2279.38862274 hartree
oneelecener: -4011.19694605 hartree
twoeener: 1731.80832331 hartree
cpcmener: -0.01636528 hartree
kineticenergy: 812.44554663 hartree
xcener: -82.314985557710 hartree
chargesum: -0.0000000
charge: -0.291822 -0.486537 0.045635 -0.160918 -0.180584 -0.181604 0.138448 -0.118630 -0.303105 -0.308661 -0.306312 -0.113374 -0.167218 0.017004 -0.259351 -0.171949 0.467875 0.037812 -0.254845 0.050822 0.078690 0.083614 0.081608 0.079132 0.078136 0.080531 -0.041851 0.092069 0.081049 0.090985 0.082133 0.092587 0.090595 0.090506 0.089234 0.093031 0.089646 0.087446 0.121625 0.114749 0.110622 0.100432 0.106696 0.112679 0.105938 0.086519 0.087070 0.088318 0.093529
qa: -0.2918 -0.4865 0.0456 -0.1609 -0.1806 -0.1816 0.1384 -0.1186 -0.3031 -0.3087 -0.3063 -0.1134 -0.1672 0.0170 -0.2594 -0.1719 0.4679 0.0378 -0.2548 0.0508 0.0787 0.0836 0.0816 0.0791 0.0781 0.0805 -0.0419 0.0921 0.0810 0.0910 0.0821 0.0926 0.0906 0.0905 0.0892 0.0930 0.0896 0.0874 0.1216 0.1147 0.1106 0.1004 0.1067 0.1127 0.1059 0.0865 0.0871 0.0883 0.0935
va: 2.1173 2.0142 3.7492 3.8628 3.9266 3.8905 3.7666 3.9216 3.9482 3.9255 3.9343 3.8456 3.8758 3.6904 3.9201 3.7706 4.1758 3.8550 3.9153 1.0211 1.0007 1.0121 1.0016 1.0086 1.0028 1.0114 1.0451 1.0054 1.0152 1.0046 1.0023 1.0032 1.0033 1.0043 1.0058 1.0054 1.0030 1.0016 1.0029 1.0222 1.0372 0.9896 0.9963 1.0341 0.9954 1.0124 1.0044 1.0137 1.0075
dispcorr: -0.022344740 hartree
energy: -816.449046800089
dipole: -19.09071 18.13226 -0.95845 12.09777 -12.30329 -0.20552 -3.50488 4.05634 0.55146
magnitude: 1.12471 au
magnitude: 2.85879 debye
