program: Orca
programVersion: 5.0.2
elementType: O O C C C C C C C C C C C C C C C C C H H H H H H H H H H H H H H H H H H H H H H H H H H H H H H
charge: 0
multiplicity: 1
keywords: wb97x-d3
keywords: def2-TZVPP
keywords: def2/J RIJCOSX
keywords: DEFGRID2
keywords: scfconv7
keywords: smallprint printgap noloewdin
keywords: NOSOSCF
formula: C17H30O2
InChI: InChI=1/C17H30O2/c1-6-19-17(18)13-16(5)12-8-11-15(4)10-7-9-14(2)3/h8,12-15H,6-7,9-11H2,1-5H3
49 atoms
O  4.150106 -1.779207 1.160866
O  3.745873 -1.68694 -1.029869
C  -3.78346 -0.23804 0.146456
C  -3.057119 1.065668 0.472783
C  -3.669294 2.314668 -0.156763
C  -2.749996 3.540367 -0.09047
C  -1.872029 3.77063 -1.32497
C  -2.959212 -1.45198 0.606317
C  -5.181484 -0.28551 0.74989
C  -1.01411 5.016413 -1.133255
C  -0.996732 2.575723 -1.688935
C  -1.653338 -1.547351 -0.106297
C  -0.454731 -1.571576 0.485857
C  0.828658 -1.622411 -0.21176
C  0.79936 -1.592646 -1.706667
C  1.938222 -1.675648 0.557054
C  3.333413 -1.713484 0.109581
C  5.562072 -1.809129 0.911801
C  6.2653 -1.878639 2.243639
H  -3.881608 -0.304719 -0.945093
H  -2.016763 0.978178 0.152869
H  -3.019153 1.192817 1.561629
H  -4.614802 2.543472 0.341401
H  -3.930316 2.110818 -1.201909
H  -3.354403 4.440672 0.053722
H  -2.111103 3.46988 0.798317
H  -2.545325 3.953464 -2.17164
H  -3.537514 -2.360493 0.402095
H  -2.8042 -1.412962 1.689068
H  -5.142485 -0.205342 1.839227
H  -5.810406 0.526899 0.383021
H  -5.689239 -1.221101 0.506293
H  -0.308088 4.88629 -0.308824
H  -1.623056 5.894408 -0.90723
H  -0.432319 5.243731 -2.028954
H  -0.381994 2.801379 -2.563163
H  -0.318607 2.310623 -0.873596
H  -1.585307 1.690187 -1.934958
H  -1.719412 -1.57891 -1.190693
H  -0.408281 -1.53889 1.57099
H  0.315962 -0.675826 -2.051539
H  0.204761 -2.423626 -2.09077
H  1.782352 -1.646428 -2.156947
H  1.804675 -1.689723 1.632909
H  5.860361 -0.912482 0.363439
H  5.812589 -2.676308 0.296329
H  6.000197 -2.78144 2.794926
H  7.342621 -1.896689 2.077258
H  6.040375 -1.012018 2.866032
elementType: O C H
totalener: -816.42686290 hartree
nucrepener: 1420.74233110 hartree
electener: -2237.16919400 hartree
oneelecener: -3926.81919689 hartree
twoeener: 1689.65000289 hartree
cpcmener: -0.01680754 hartree
kineticenergy: 812.44370425 hartree
xcener: -82.310595897307 hartree
chargesum: 0.0000000
charge: -0.286531 -0.486349 0.078215 -0.195036 -0.127429 -0.188924 0.093934 -0.114297 -0.313956 -0.300241 -0.313947 -0.139107 -0.143242 0.015844 -0.255562 -0.170787 0.462853 0.040418 -0.251868 0.040484 0.075929 0.077691 0.084194 0.067135 0.083320 0.066346 0.026813 0.095005 0.079994 0.083694 0.093387 0.091547 0.080969 0.087536 0.089058 0.099848 0.084125 0.080394 0.122158 0.111349 0.099321 0.104955 0.109282 0.113035 0.093796 0.092810 0.087205 0.087615 0.087020
qa: -0.2865 -0.4863 0.0782 -0.1950 -0.1274 -0.1889 0.0939 -0.1143 -0.3140 -0.3002 -0.3139 -0.1391 -0.1432 0.0158 -0.2556 -0.1708 0.4629 0.0404 -0.2519 0.0405 0.0759 0.0777 0.0842 0.0671 0.0833 0.0663 0.0268 0.0950 0.0800 0.0837 0.0934 0.0915 0.0810 0.0875 0.0891 0.0998 0.0841 0.0804 0.1222 0.1113 0.0993 0.1050 0.1093 0.1130 0.0938 0.0928 0.0872 0.0876 0.0870
va: 2.1194 2.0190 3.7727 3.8929 3.8501 3.9022 3.8122 3.9163 3.9503 3.9360 3.9358 3.8755 3.8863 3.6959 3.9174 3.7803 4.1680 3.8501 3.9696 1.0243 0.9961 1.0177 1.0058 1.0083 1.0063 1.0087 1.0177 1.0060 1.0161 1.0016 1.0016 1.0048 1.0033 1.0051 1.0052 1.0067 0.9996 1.0019 1.0051 1.0234 0.9959 0.9967 1.0377 1.0325 0.9964 0.9965 1.0034 1.0067 1.0035
dispcorr: -0.020307882 hartree
energy: -816.447170782422
dipole: -18.92731 17.96025 -0.96706 16.85721 -16.76120 0.09602 -0.95852 1.57786 0.61933
magnitude: 1.15238 au
magnitude: 2.92913 debye
