program: Orca
programVersion: 5.0.2
elementType: O O C C C C C C C C C C C C C C C C C H H H H H H H H H H H H H H H H H H H H H H H H H H H H H H
charge: 0
multiplicity: 1
keywords: wb97x-d3
keywords: def2-TZVPP
keywords: def2/J RIJCOSX
keywords: DEFGRID2
keywords: scfconv7
keywords: smallprint printgap noloewdin
keywords: NOSOSCF
formula: C17H30O2
InChI: InChI=1/C17H30O2/c1-6-19-17(18)13-16(5)12-8-11-15(4)10-7-9-14(2)3/h8,12-15H,6-7,9-11H2,1-5H3
49 atoms
O  5.190535 -2.878735 -0.283601
O  3.998547 -3.786769 1.374554
C  -1.876116 1.011336 -0.214732
C  -2.918728 1.803417 -1.004758
C  -3.6317 2.887215 -0.204127
C  -4.740252 3.563561 -1.001941
C  -5.419734 4.735241 -0.291198
C  -1.33463 -0.144224 -1.072991
C  -0.740159 1.896531 0.284108
C  -6.373842 5.451049 -1.240637
C  -6.155819 4.297068 0.970611
C  -0.465694 -1.07472 -0.299432
C  0.825298 -1.304835 -0.560489
C  1.698617 -2.187895 0.209053
C  1.101238 -2.901118 1.379648
C  2.983451 -2.274803 -0.19806
C  4.063352 -3.05993 0.40689
C  6.382901 -3.537436 0.160442
C  7.062509 -2.789062 1.284762
H  -2.378189 0.571516 0.656552
H  -3.667878 1.105202 -1.39465
H  -2.439013 2.253417 -1.882322
H  -2.915755 3.648336 0.121068
H  -4.040623 2.442578 0.708866
H  -4.318985 3.924117 -1.947164
H  -5.500759 2.821852 -1.274857
H  -4.639192 5.448437 0.001848
H  -0.792706 0.256994 -1.935003
H  -2.186567 -0.709521 -1.46786
H  -1.096181 2.672928 0.962086
H  0.011329 1.321519 0.827641
H  -0.234947 2.391895 -0.549548
H  -7.176111 4.786415 -1.571802
H  -5.855754 5.809492 -2.132673
H  -6.840868 6.315333 -0.763765
H  -6.651178 5.14297 1.45194
H  -6.925322 3.555849 0.738313
H  -5.485997 3.855746 1.710213
H  -0.944812 -1.571639 0.539781
H  1.284513 -0.793221 -1.402049
H  0.701925 -2.179995 2.095491
H  1.806988 -3.536629 1.899062
H  0.261343 -3.51914 1.056506
H  3.275722 -1.696634 -1.067398
H  7.025107 -3.564875 -0.71924
H  6.166736 -4.568841 0.444019
H  8.000812 -3.288737 1.530025
H  7.29877 -1.764901 0.993747
H  6.456772 -2.761111 2.189982
elementType: O C H
totalener: -816.43013958 hartree
nucrepener: 1342.84833126 hartree
electener: -2159.27847084 hartree
oneelecener: -3770.97930859 hartree
twoeener: 1611.70083775 hartree
cpcmener: -0.01631710 hartree
kineticenergy: 812.45187243 hartree
xcener: -82.312089539771 hartree
chargesum: -0.0000000
charge: -0.292789 -0.487143 0.107932 -0.179471 -0.118162 -0.158529 0.070276 -0.105187 -0.338769 -0.294032 -0.302246 -0.153047 -0.145108 0.014546 -0.264605 -0.175942 0.471583 0.039870 -0.255835 0.041777 0.070576 0.069057 0.064895 0.065910 0.067684 0.065893 0.025376 0.078701 0.092868 0.097090 0.097945 0.084751 0.080081 0.087340 0.088697 0.090270 0.081552 0.089890 0.123238 0.110850 0.103951 0.109062 0.104677 0.113506 0.106273 0.085710 0.093261 0.087112 0.088666
qa: -0.2928 -0.4871 0.1079 -0.1795 -0.1182 -0.1585 0.0703 -0.1052 -0.3388 -0.2940 -0.3022 -0.1530 -0.1451 0.0145 -0.2646 -0.1759 0.4716 0.0399 -0.2558 0.0418 0.0706 0.0691 0.0649 0.0659 0.0677 0.0659 0.0254 0.0787 0.0929 0.0971 0.0979 0.0848 0.0801 0.0873 0.0887 0.0903 0.0816 0.0899 0.1232 0.1108 0.1040 0.1091 0.1047 0.1135 0.1063 0.0857 0.0933 0.0871 0.0887
va: 2.1176 2.0132 3.7472 3.9124 3.8677 3.8903 3.8208 3.9218 3.9527 3.9316 3.9278 3.8879 3.9233 3.6986 3.9201 3.7689 4.1732 3.8523 3.9164 1.0228 1.0124 1.0110 1.0096 1.0089 1.0118 1.0125 1.0185 1.0167 1.0066 1.0022 1.0023 1.0025 1.0034 1.0049 1.0051 1.0046 1.0029 1.0026 1.0049 1.0243 0.9960 1.0370 0.9963 1.0335 0.9953 1.0129 1.0074 1.0042 1.0137
dispcorr: -0.018495464 hartree
energy: -816.448635045733
dipole: -29.73952 29.20579 -0.53373 26.67744 -25.85034 0.82710 -0.21117 -0.33954 -0.55071
magnitude: 1.12793 au
magnitude: 2.86698 debye
