program: Orca
programVersion: 5.0.2
elementType: O O C C C C C C C C C C C C C C C C C H H H H H H H H H H H H H H H H H H H H H H H H H H H H H H
charge: 0
multiplicity: 1
keywords: wb97x-d3
keywords: def2-TZVPP
keywords: def2/J RIJCOSX
keywords: DEFGRID2
keywords: scfconv7
keywords: smallprint printgap noloewdin
keywords: NOSOSCF
formula: C17H30O2
InChI: InChI=1/C17H30O2/c1-6-19-17(18)13-16(5)12-8-11-15(4)10-7-9-14(2)3/h8,12-15H,6-7,9-11H2,1-5H3
49 atoms
O  3.69341 -1.259122 1.192042
O  3.343648 -1.733646 -0.964502
C  -4.190934 -0.275727 0.07061
C  -3.515912 1.051484 0.442968
C  -2.421526 1.52517 -0.508038
C  -1.742259 2.804116 -0.02989
C  -0.522865 3.22822 -0.853204
C  -3.386831 -1.504909 0.535163
C  -5.593513 -0.344125 0.666799
C  -0.078249 4.632118 -0.459322
C  0.635658 2.24669 -0.701882
C  -2.069635 -1.67149 -0.139239
C  -0.884526 -1.656062 0.480568
C  0.410858 -1.749344 -0.187302
C  0.409792 -1.996548 -1.662564
C  1.506881 -1.559529 0.579918
C  2.907371 -1.535859 0.149003
C  5.104803 -1.137577 0.978503
C  5.483726 0.224998 0.443901
H  -4.286604 -0.324587 -1.021195
H  -3.1099 0.969357 1.458515
H  -4.282196 1.832636 0.495894
H  -2.85319 1.692946 -1.500847
H  -1.675753 0.740008 -0.632124
H  -2.477075 3.617027 -0.030123
H  -1.431112 2.682218 1.01523
H  -0.81498 3.250498 -1.910402
H  -3.98847 -2.397175 0.325832
H  -3.25596 -1.461277 1.620857
H  -6.095631 -1.279603 0.412069
H  -5.563735 -0.273179 1.757159
H  -6.217075 0.474088 0.302461
H  0.205744 4.672551 0.595634
H  -0.874457 5.36348 -0.612559
H  0.784856 4.95953 -1.042585
H  1.504519 2.567725 -1.280154
H  0.948243 2.168223 0.34275
H  0.380254 1.242434 -1.043363
H  -2.111985 -1.799161 -1.217424
H  -0.860246 -1.513638 1.557503
H  -0.067039 -1.163377 -2.184156
H  -0.175277 -2.887464 -1.896696
H  1.402292 -2.125326 -2.075585
H  1.354129 -1.376001 1.637417
H  5.463075 -1.934535 0.324439
H  5.54518 -1.295052 1.962658
H  6.570924 0.301373 0.398549
H  5.09843 0.39837 -0.56032
H  5.122658 1.021049 1.095903
elementType: O C H
totalener: -816.42614117 hartree
nucrepener: 1470.53719885 hartree
electener: -2286.96334003 hartree
oneelecener: -4026.54521726 hartree
twoeener: 1739.58187723 hartree
cpcmener: -0.01653018 hartree
kineticenergy: 812.44254777 hartree
xcener: -82.311414236185 hartree
chargesum: 0.0000000
charge: -0.292935 -0.487309 0.084431 -0.187930 -0.079071 -0.165414 0.082881 -0.123283 -0.303928 -0.293578 -0.292168 -0.106735 -0.160256 -0.009159 -0.261996 -0.184807 0.483787 0.038486 -0.256361 0.040785 0.066913 0.076305 0.068208 0.019401 0.072499 0.063920 0.024365 0.092557 0.080234 0.089060 0.086525 0.088769 0.080400 0.086675 0.089013 0.094521 0.083597 0.070642 0.130174 0.109868 0.102532 0.110838 0.112859 0.112180 0.086246 0.106290 0.093649 0.088847 0.087470
qa: -0.2929 -0.4873 0.0844 -0.1879 -0.0791 -0.1654 0.0829 -0.1233 -0.3039 -0.2936 -0.2922 -0.1067 -0.1603 -0.0092 -0.2620 -0.1848 0.4838 0.0385 -0.2564 0.0408 0.0669 0.0763 0.0682 0.0194 0.0725 0.0639 0.0244 0.0926 0.0802 0.0891 0.0865 0.0888 0.0804 0.0867 0.0890 0.0945 0.0836 0.0706 0.1302 0.1099 0.1025 0.1108 0.1129 0.1122 0.0862 0.1063 0.0936 0.0888 0.0875
va: 2.1157 2.0118 3.7529 3.9219 3.8430 3.8998 3.8280 3.9281 3.9352 3.9265 3.9363 3.8585 3.8984 3.6792 3.9057 3.7509 4.1590 3.8545 3.9158 1.0222 1.0093 1.0065 1.0169 1.0402 1.0110 1.0118 1.0172 1.0060 1.0141 1.0049 1.0001 1.0045 1.0031 1.0053 1.0054 1.0068 1.0034 1.0035 1.0021 1.0240 0.9929 0.9981 1.0363 1.0347 1.0126 0.9952 1.0074 1.0137 1.0044
dispcorr: -0.021917235 hartree
energy: -816.448058410071
dipole: -14.81372 13.82014 -0.99357 17.19200 -16.89234 0.29966 -1.55276 2.03898 0.48623
magnitude: 1.14604 au
magnitude: 2.91300 debye
