program: Orca
programVersion: 5.0.2
elementType: O O C C C C C C C C C C C C C C C C C H H H H H H H H H H H H H H H H H H H H H H H H H H H H H H
charge: 0
multiplicity: 1
keywords: wb97x-d3
keywords: def2-TZVPP
keywords: def2/J RIJCOSX
keywords: DEFGRID2
keywords: scfconv7
keywords: smallprint printgap noloewdin
keywords: NOSOSCF
formula: C17H30O2
InChI: InChI=1/C17H30O2/c1-6-19-17(18)13-16(5)12-8-11-15(4)10-7-9-14(2)3/h8,12-15H,6-7,9-11H2,1-5H3
49 atoms
O  3.95948 -1.464857 1.019514
O  3.470313 -1.581728 -1.152942
C  -4.162255 -0.371131 0.221054
C  -3.685711 1.074458 0.401907
C  -2.579631 1.540591 -0.539319
C  -2.230584 3.011529 -0.344784
C  -1.07367 3.513841 -1.212102
C  -3.165978 -1.421781 0.740532
C  -5.500642 -0.566722 0.927041
C  -0.934604 5.026993 -1.086709
C  0.244668 2.830895 -0.860719
C  -1.891022 -1.524031 -0.02395
C  -0.670879 -1.511046 0.523984
C  0.584211 -1.58801 -0.218318
C  0.496829 -1.72831 -1.704686
C  1.725032 -1.508013 0.501821
C  3.101569 -1.526965 0.000674
C  5.360921 -1.462615 0.718734
C  6.112753 -1.404942 2.024297
H  -4.315996 -0.552215 -0.850291
H  -3.365017 1.214734 1.441228
H  -4.549112 1.735699 0.267249
H  -2.891292 1.376221 -1.577084
H  -1.687532 0.932405 -0.390844
H  -3.120088 3.617288 -0.55139
H  -1.982632 3.191063 0.708689
H  -1.308467 3.28243 -2.258403
H  -3.66141 -2.398947 0.681867
H  -2.960406 -1.243848 1.800761
H  -5.878713 -1.582898 0.799843
H  -5.411368 -0.381147 2.000422
H  -6.257586 0.116845 0.538604
H  -1.852547 5.540283 -1.380654
H  -0.129344 5.409867 -1.71697
H  -0.711277 5.318906 -0.057211
H  1.066301 3.224984 -1.462207
H  0.501743 2.991575 0.189817
H  0.215519 1.753409 -1.029385
H  -1.998254 -1.627265 -1.100307
H  -0.584681 -1.401601 1.601627
H  -0.084369 -2.614351 -1.96671
H  1.463547 -1.804247 -2.185873
H  -0.028574 -0.872143 -2.133248
H  1.634345 -1.412419 1.577932
H  5.604511 -0.600754 0.092828
H  5.622903 -2.365163 0.161615
H  7.183537 -1.401728 1.819486
H  5.879988 -0.49959 2.585853
H  5.897657 -2.2694 2.653178
elementType: O C H
totalener: -816.42819522 hartree
nucrepener: 1436.57945221 hartree
electener: -2253.00764744 hartree
oneelecener: -3958.54487910 hartree
twoeener: 1705.53723166 hartree
cpcmener: -0.01700831 hartree
kineticenergy: 812.44380322 hartree
xcener: -82.310961113786 hartree
chargesum: 0.0000000
charge: -0.286723 -0.487318 0.085908 -0.188620 -0.049607 -0.175857 0.081736 -0.113563 -0.301295 -0.296816 -0.286628 -0.136778 -0.136669 -0.008434 -0.256949 -0.169362 0.466098 0.040271 -0.251900 0.037722 0.067062 0.072084 0.063943 0.013710 0.069592 0.064541 0.023368 0.094676 0.079993 0.089930 0.085077 0.088943 0.087213 0.089265 0.080413 0.092238 0.083419 0.073008 0.129154 0.108747 0.108260 0.110616 0.099517 0.112196 0.093726 0.092628 0.087382 0.087047 0.087037
qa: -0.2867 -0.4873 0.0859 -0.1886 -0.0496 -0.1759 0.0817 -0.1136 -0.3013 -0.2968 -0.2866 -0.1368 -0.1367 -0.0084 -0.2569 -0.1694 0.4661 0.0403 -0.2519 0.0377 0.0671 0.0721 0.0639 0.0137 0.0696 0.0645 0.0234 0.0947 0.0800 0.0899 0.0851 0.0889 0.0872 0.0893 0.0804 0.0922 0.0834 0.0730 0.1292 0.1087 0.1083 0.1106 0.0995 0.1122 0.0937 0.0926 0.0874 0.0870 0.0870
va: 2.1187 2.0176 3.7739 3.9295 3.8310 3.9232 3.8171 3.9064 3.9330 3.9286 3.9329 3.8980 3.8973 3.6943 3.9150 3.7700 4.1662 3.8503 3.9698 1.0224 1.0097 1.0078 1.0150 1.0459 1.0121 1.0103 1.0178 1.0036 1.0149 1.0048 1.0010 1.0053 1.0051 1.0053 1.0031 1.0055 1.0041 1.0023 1.0026 1.0241 0.9972 1.0370 0.9946 1.0332 0.9963 0.9963 1.0067 1.0034 1.0034
dispcorr: -0.020448544 hartree
energy: -816.448643767306
dipole: -16.68371 15.71503 -0.96868 15.94953 -15.90034 0.04919 0.35212 0.28450 0.63662
magnitude: 1.16019 au
magnitude: 2.94897 debye
