program: Orca
programVersion: 5.0.2
elementType: O O C C C C C C C C C C C C C C C C C H H H H H H H H H H H H H H H H H H H H H H H H H H H H H H
charge: 0
multiplicity: 1
keywords: wb97x-d3
keywords: def2-TZVPP
keywords: def2/J RIJCOSX
keywords: DEFGRID2
keywords: scfconv7
keywords: smallprint printgap noloewdin
keywords: NOSOSCF
formula: C17H30O2
InChI: InChI=1/C17H30O2/c1-6-19-17(18)13-16(5)12-8-11-15(4)10-7-9-14(2)3/h8,12-15H,6-7,9-11H2,1-5H3
49 atoms
O  5.024591 -2.42822 1.06024
O  3.981613 -3.961488 -0.188088
C  -1.879964 0.97594 -0.481828
C  -2.775287 2.107806 0.027718
C  -2.873677 3.302063 -0.915958
C  -3.569625 4.514143 -0.302514
C  -5.027481 4.311047 0.117977
C  -1.652764 -0.050184 0.643359
C  -2.448474 0.321366 -1.735453
C  -5.564984 5.582776 0.764874
C  -5.908913 3.893355 -1.053953
C  -0.718984 -1.151225 0.262326
C  0.562736 -1.198114 0.641659
C  1.525556 -2.229054 0.259624
C  1.030048 -3.357897 -0.58666
C  2.791735 -2.068166 0.702179
C  3.948619 -2.934181 0.454002
C  6.277353 -3.111768 0.930267
C  6.984941 -2.772039 -0.361734
H  -0.901688 1.405277 -0.731145
H  -2.385242 2.458743 0.99015
H  -3.772371 1.703434 0.236049
H  -3.376902 3.017251 -1.843745
H  -1.86171 3.601541 -1.208442
H  -2.99513 4.842837 0.570854
H  -3.529516 5.343792 -1.01793
H  -5.065813 3.51547 0.87092
H  -2.620693 -0.47707 0.92857
H  -1.263873 0.472458 1.521352
H  -1.789678 -0.455805 -2.126583
H  -3.418597 -0.140073 -1.531726
H  -2.590322 1.044554 -2.539317
H  -4.965029 5.878713 1.628262
H  -6.592978 5.454367 1.109918
H  -5.557829 6.417804 0.0592
H  -5.875112 4.636147 -1.855808
H  -5.606899 2.935364 -1.48081
H  -6.951753 3.791934 -0.74613
H  -1.120409 -1.931803 -0.37614
H  0.942338 -0.405724 1.281757
H  0.625219 -2.97667 -1.52617
H  0.212232 -3.874878 -0.080842
H  1.796444 -4.086209 -0.82042
H  3.002976 -1.196399 1.311306
H  6.137448 -4.1891 1.033713
H  6.863352 -2.771854 1.783507
H  7.970326 -3.240035 -0.361275
H  6.446543 -3.134803 -1.236913
H  7.129744 -1.695967 -0.464285
elementType: O C H
totalener: -816.42787100 hartree
nucrepener: 1356.36495582 hartree
electener: -2172.79282681 hartree
oneelecener: -3797.95541112 hartree
twoeener: 1625.16258430 hartree
cpcmener: -0.01641953 hartree
kineticenergy: 812.43509076 hartree
xcener: -82.309483478806 hartree
chargesum: 0.0000000
charge: -0.292038 -0.486380 0.120865 -0.193908 -0.130229 -0.189087 0.065038 -0.127574 -0.332038 -0.297435 -0.303093 -0.141498 -0.142967 0.008794 -0.263387 -0.174470 0.468134 0.037852 -0.254592 0.042578 0.075399 0.070119 0.070359 0.078786 0.073463 0.078864 0.035219 0.093785 0.080963 0.093602 0.086452 0.095659 0.088306 0.089175 0.080908 0.084605 0.087045 0.091516 0.129707 0.110857 0.103538 0.104623 0.107903 0.113185 0.085901 0.106490 0.093941 0.088603 0.086462
qa: -0.2920 -0.4864 0.1209 -0.1939 -0.1302 -0.1891 0.0650 -0.1276 -0.3320 -0.2974 -0.3031 -0.1415 -0.1430 0.0088 -0.2634 -0.1745 0.4681 0.0379 -0.2546 0.0426 0.0754 0.0701 0.0704 0.0788 0.0735 0.0789 0.0352 0.0938 0.0810 0.0936 0.0865 0.0957 0.0883 0.0892 0.0809 0.0846 0.0870 0.0915 0.1297 0.1109 0.1035 0.1046 0.1079 0.1132 0.0859 0.1065 0.0939 0.0886 0.0865
va: 2.1174 2.0143 3.7662 3.9109 3.8694 3.9108 3.7898 3.9261 3.9568 3.9280 3.9328 3.8744 3.9129 3.7046 3.9227 3.7684 4.1743 3.8546 3.9155 1.0245 1.0105 1.0083 1.0037 1.0110 1.0089 1.0105 1.0157 1.0060 1.0170 1.0022 1.0010 1.0024 1.0045 1.0049 1.0039 1.0029 1.0007 1.0054 0.9946 1.0236 0.9964 0.9962 1.0370 1.0338 1.0126 0.9953 1.0071 1.0135 1.0046
dispcorr: -0.019021830 hartree
energy: -816.446892827074
dipole: -29.16745 28.61052 -0.55693 24.49660 -23.56812 0.92848 -6.16409 6.43686 0.27277
magnitude: 1.11654 au
magnitude: 2.83801 debye
