program: Orca
programVersion: 5.0.2
elementType: O O C C C C C C C C C C C C C C C C C H H H H H H H H H H H H H H H H H H H H H H H H H H H H H H
charge: 0
multiplicity: 1
keywords: wb97x-d3
keywords: def2-TZVPP
keywords: def2/J RIJCOSX
keywords: DEFGRID2
keywords: scfconv7
keywords: smallprint printgap noloewdin
keywords: NOSOSCF
formula: C17H30O2
InChI: InChI=1/C17H30O2/c1-6-19-17(18)13-16(5)12-8-11-15(4)10-7-9-14(2)3/h8,12-15H,6-7,9-11H2,1-5H3
49 atoms
O  3.861855 -1.247985 0.964263
O  3.382082 -1.710659 -1.164724
C  -4.186751 -0.340735 0.202033
C  -3.622995 1.067634 0.426169
C  -2.539444 1.514196 -0.549879
C  -2.022355 2.916175 -0.24969
C  -0.839031 3.359094 -1.114025
C  -3.25818 -1.45509 0.718648
C  -5.548678 -0.472536 0.876534
C  -0.548723 4.839928 -0.89677
C  0.412793 2.532077 -0.836099
C  -1.979346 -1.603528 -0.030516
C  -0.759464 -1.557843 0.516096
C  0.494064 -1.650995 -0.227534
C  0.404049 -1.875386 -1.703454
C  1.635525 -1.491687 0.477791
C  3.010294 -1.505041 -0.029192
C  5.261004 -1.197371 0.657936
C  5.999422 -0.868979 1.931222
H  -4.32849 -0.491234 -0.875561
H  -3.242721 1.135627 1.452605
H  -4.44929 1.78501 0.37006
H  -2.935588 1.483953 -1.570972
H  -1.709985 0.808065 -0.526618
H  -2.843368 3.631695 -0.371011
H  -1.72595 2.976039 0.805077
H  -1.114612 3.218867 -2.166598
H  -3.802342 -2.403646 0.634641
H  -3.061023 -1.30236 1.784277
H  -5.473356 -0.306759 1.954322
H  -6.258045 0.257147 0.482094
H  -5.979194 -1.464455 0.72588
H  -0.283086 5.039362 0.144854
H  -1.415192 5.45907 -1.138399
H  0.282151 5.182375 -1.517057
H  0.719484 2.626074 0.209168
H  0.268532 1.469653 -1.03993
H  1.25039 2.863458 -1.453412
H  -2.083286 -1.749614 -1.1023
H  -0.671985 -1.397321 1.587201
H  -0.140519 -1.054494 -2.175324
H  -0.159609 -2.785898 -1.914832
H  1.370655 -1.956905 -2.184231
H  1.546698 -1.318718 1.544439
H  5.446604 -0.436374 -0.10371
H  5.588452 -2.15914 0.256226
H  5.844565 -1.629471 2.697208
H  7.068461 -0.821604 1.722544
H  5.697318 0.097915 2.33504
elementType: O C H
totalener: -816.42771776 hartree
nucrepener: 1448.74631441 hartree
electener: -2265.17403217 hartree
oneelecener: -3982.87719686 hartree
twoeener: 1717.70316469 hartree
cpcmener: -0.01699726 hartree
kineticenergy: 812.44271130 hartree
xcener: -82.310881520173 hartree
chargesum: 0.0000000
charge: -0.286097 -0.486620 0.086048 -0.189951 -0.052360 -0.172689 0.079294 -0.115922 -0.301534 -0.295200 -0.282417 -0.122585 -0.147517 -0.007701 -0.259216 -0.172415 0.469719 0.041069 -0.251185 0.038186 0.066671 0.074351 0.065186 0.006123 0.070938 0.063499 0.024055 0.093409 0.079738 0.085960 0.088644 0.089226 0.080672 0.086394 0.089333 0.083270 0.068161 0.093306 0.129623 0.109542 0.100763 0.109917 0.111608 0.112118 0.092335 0.093171 0.087096 0.086798 0.087185
qa: -0.2861 -0.4866 0.0860 -0.1900 -0.0524 -0.1727 0.0793 -0.1159 -0.3015 -0.2952 -0.2824 -0.1226 -0.1475 -0.0077 -0.2592 -0.1724 0.4697 0.0411 -0.2512 0.0382 0.0667 0.0744 0.0652 0.0061 0.0709 0.0635 0.0241 0.0934 0.0797 0.0860 0.0886 0.0892 0.0807 0.0864 0.0893 0.0833 0.0682 0.0933 0.1296 0.1095 0.1008 0.1099 0.1116 0.1121 0.0923 0.0932 0.0871 0.0868 0.0872
va: 2.1182 2.0187 3.7628 3.9293 3.8295 3.9163 3.8264 3.9164 3.9333 3.9275 3.9328 3.8795 3.8988 3.6865 3.9099 3.7630 4.1619 3.8499 3.9694 1.0225 1.0095 1.0071 1.0167 1.0501 1.0115 1.0111 1.0173 1.0045 1.0150 1.0003 1.0050 1.0050 1.0030 1.0054 1.0052 1.0044 1.0039 1.0060 1.0027 1.0237 0.9933 0.9977 1.0374 1.0334 0.9965 0.9964 1.0033 1.0071 1.0034
dispcorr: -0.020940778 hartree
energy: -816.448658538049
dipole: -15.67552 14.71174 -0.96378 16.08924 -15.87485 0.21439 0.59161 0.02267 0.61427
magnitude: 1.16283 au
magnitude: 2.95568 debye
