program: Orca
programVersion: 5.0.2
elementType: O O C C C C C C C C C C C C C C C C C H H H H H H H H H H H H H H H H H H H H H H H H H H H H H H
charge: 0
multiplicity: 1
keywords: wb97x-d3
keywords: def2-TZVPP
keywords: def2/J RIJCOSX
keywords: DEFGRID2
keywords: scfconv7
keywords: smallprint printgap noloewdin
keywords: NOSOSCF
formula: C17H30O2
InChI: InChI=1/C17H30O2/c1-6-19-17(18)13-16(5)12-8-11-15(4)10-7-9-14(2)3/h8,12-15H,6-7,9-11H2,1-5H3
49 atoms
O  4.063397 -3.539597 0.588551
O  4.42918 -1.434177 -0.064486
C  -3.189174 -0.547217 -0.02405
C  -3.027149 0.573434 -1.056045
C  -3.320968 1.985415 -0.559627
C  -3.180434 3.018451 -1.672174
C  -3.539936 4.451366 -1.275806
C  -2.278365 -0.38539 1.206672
C  -4.637462 -0.718311 0.420028
C  -2.598741 5.01036 -0.214198
C  -3.547249 5.353471 -2.504842
C  -0.842435 -0.200474 0.846709
C  0.075032 -1.171017 0.918203
C  1.478647 -1.040069 0.533405
C  1.933927 0.293686 0.034117
C  2.246449 -2.144794 0.656632
C  3.672953 -2.286026 0.34867
C  5.440755 -3.881281 0.38804
C  6.302886 -3.491088 1.567356
H  -2.883729 -1.475763 -0.519821
H  -3.685568 0.350527 -1.902633
H  -2.010253 0.545446 -1.462192
H  -2.648548 2.23431 0.266528
H  -4.33579 2.037832 -0.151924
H  -2.1535 3.002644 -2.057767
H  -3.819374 2.716432 -2.509721
H  -4.554767 4.440955 -0.859313
H  -2.392583 -1.268237 1.841279
H  -2.617399 0.471447 1.797908
H  -4.999943 0.146349 0.979608
H  -5.298882 -0.85703 -0.43768
H  -4.751806 -1.591926 1.064827
H  -2.622732 4.430943 0.709831
H  -2.862218 6.037868 0.045252
H  -1.565388 5.018283 -0.571838
H  -2.558725 5.394463 -2.969784
H  -4.250384 4.996566 -3.26038
H  -3.831531 6.376606 -2.250389
H  -0.55956 0.783278 0.484467
H  -0.229628 -2.147474 1.285975
H  2.982462 0.315926 -0.234778
H  1.760733 1.059103 0.793083
H  1.352062 0.585792 -0.842419
H  1.772598 -3.045574 1.030191
H  5.8135 -3.440468 -0.537989
H  5.439179 -4.963282 0.260976
H  6.345657 -2.411619 1.71005
H  5.945733 -3.949629 2.49005
H  7.321355 -3.842245 1.395699
elementType: O C H
totalener: -816.42791752 hartree
nucrepener: 1386.47111466 hartree
electener: -2202.89903218 hartree
oneelecener: -3858.14026248 hartree
twoeener: 1655.24123030 hartree
cpcmener: -0.01647351 hartree
kineticenergy: 812.44253146 hartree
xcener: -82.311470688471 hartree
chargesum: 0.0000000
charge: -0.293333 -0.485941 0.084969 -0.168305 -0.143616 -0.162413 0.079620 -0.165194 -0.326910 -0.303950 -0.295711 -0.121162 -0.147143 0.013013 -0.264882 -0.176543 0.467774 0.040203 -0.256197 0.054390 0.083473 0.079759 0.064934 0.075232 0.067160 0.069147 0.024991 0.088275 0.097615 0.083137 0.093564 0.094877 0.089077 0.091023 0.082163 0.080598 0.087159 0.089010 0.127358 0.110285 0.109513 0.104576 0.103463 0.113437 0.085321 0.106354 0.089071 0.087324 0.093436
qa: -0.2933 -0.4859 0.0850 -0.1683 -0.1436 -0.1624 0.0796 -0.1652 -0.3269 -0.3040 -0.2957 -0.1212 -0.1471 0.0130 -0.2649 -0.1765 0.4678 0.0402 -0.2562 0.0544 0.0835 0.0798 0.0649 0.0752 0.0672 0.0691 0.0250 0.0883 0.0976 0.0831 0.0936 0.0949 0.0891 0.0910 0.0822 0.0806 0.0872 0.0890 0.1274 0.1103 0.1095 0.1046 0.1035 0.1134 0.0853 0.1064 0.0891 0.0873 0.0934
va: 2.1175 2.0147 3.7988 3.8798 3.8614 3.8840 3.8116 3.9258 3.9517 3.9277 3.9307 3.8703 3.9340 3.7017 3.9200 3.7718 4.1755 3.8522 3.9163 1.0161 1.0096 1.0069 1.0025 1.0080 1.0126 1.0121 1.0187 1.0143 0.9976 0.9984 1.0035 1.0037 1.0021 1.0046 1.0031 1.0032 1.0050 1.0051 0.9911 1.0244 1.0373 0.9961 0.9968 1.0335 1.0131 0.9954 1.0135 1.0041 1.0073
dispcorr: -0.019370476 hartree
energy: -816.447287994740
dipole: -24.33429 23.23389 -1.10041 20.47315 -20.73363 -0.26047 -4.05716 4.37351 0.31635
magnitude: 1.17423 au
magnitude: 2.98466 debye
