program: Orca
programVersion: 5.0.2
elementType: O O C C C C C C C C C C C C C C C C C H H H H H H H H H H H H H H H H H H H H H H H H H H H H H H
charge: 0
multiplicity: 1
keywords: wb97x-d3
keywords: def2-TZVPP
keywords: def2/J RIJCOSX
keywords: DEFGRID2
keywords: scfconv7
keywords: smallprint printgap noloewdin
keywords: NOSOSCF
formula: C17H30O2
InChI: InChI=1/C17H30O2/c1-6-19-17(18)13-16(5)12-8-11-15(4)10-7-9-14(2)3/h8,12-15H,6-7,9-11H2,1-5H3
49 atoms
O  4.304875 -1.473248 0.205212
O  3.275474 -3.133373 1.281579
C  -3.689476 0.047764 -0.250977
C  -3.096904 0.839224 0.916647
C  -2.196001 2.011441 0.537057
C  -2.898721 3.093912 -0.27487
C  -2.072533 4.364241 -0.484632
C  -2.609002 -0.498914 -1.202232
C  -4.600915 -1.060552 0.266586
C  -0.805868 4.098554 -1.291423
C  -2.913766 5.443297 -1.156435
C  -1.592335 -1.35293 -0.522564
C  -0.275511 -1.118373 -0.5449
C  0.737959 -1.925713 0.130834
C  0.265536 -3.101076 0.925354
C  2.023049 -1.533871 -0.010954
C  3.21768 -2.154008 0.569512
C  5.576923 -1.931634 0.680434
C  6.63364 -1.002429 0.138595
H  -4.309783 0.723812 -0.848925
H  -2.534212 0.153134 1.559637
H  -3.921461 1.213725 1.533141
H  -1.318659 1.64427 -0.002057
H  -1.809919 2.457979 1.459637
H  -3.191401 2.701224 -1.255782
H  -3.832803 3.361223 0.232923
H  -1.774027 4.737086 0.503075
H  -2.113188 0.324822 -1.722052
H  -3.109961 -1.092395 -1.975921
H  -4.067912 -1.767997 0.905779
H  -5.418005 -0.646521 0.860755
H  -5.047859 -1.627789 -0.552494
H  -0.244408 5.019905 -1.460504
H  -1.046509 3.67757 -2.271625
H  -0.132967 3.400889 -0.790769
H  -2.353772 6.373531 -1.272855
H  -3.237055 5.129545 -2.152539
H  -3.811123 5.672126 -0.577486
H  -1.972838 -2.212388 0.021304
H  0.090735 -0.257426 -1.098247
H  -0.280846 -3.795426 0.284026
H  -0.431924 -2.774258 1.699113
H  1.069818 -3.645734 1.403348
H  2.217575 -0.656973 -0.618302
H  5.751942 -2.956022 0.34326
H  5.586754 -1.932953 1.772948
H  6.651776 -1.002561 -0.951766
H  6.487408 0.021467 0.484322
H  7.61242 -1.333222 0.486529
elementType: O C H
totalener: -816.42881895 hartree
nucrepener: 1415.89161964 hartree
electener: -2232.32043859 hartree
oneelecener: -3916.97541829 hartree
twoeener: 1684.65497970 hartree
cpcmener: -0.01701406 hartree
kineticenergy: 812.43747317 hartree
xcener: -82.311800954823 hartree
chargesum: 0.0000000
charge: -0.286185 -0.485614 0.070136 -0.206253 -0.111208 -0.171489 0.073835 -0.109122 -0.311310 -0.303807 -0.292815 -0.155927 -0.148926 0.017304 -0.266427 -0.168782 0.459884 0.039497 -0.251641 0.051259 0.083009 0.082459 0.059014 0.078358 0.064587 0.073157 0.025932 0.082173 0.098810 0.080254 0.093245 0.093465 0.091979 0.081244 0.089905 0.089220 0.079439 0.086961 0.131530 0.111607 0.105284 0.104326 0.109825 0.113348 0.093987 0.093053 0.086998 0.087435 0.086990
qa: -0.2862 -0.4856 0.0701 -0.2063 -0.1112 -0.1715 0.0738 -0.1091 -0.3113 -0.3038 -0.2928 -0.1559 -0.1489 0.0173 -0.2664 -0.1688 0.4599 0.0395 -0.2516 0.0513 0.0830 0.0825 0.0590 0.0784 0.0646 0.0732 0.0259 0.0822 0.0988 0.0803 0.0932 0.0935 0.0920 0.0812 0.0899 0.0892 0.0794 0.0870 0.1315 0.1116 0.1053 0.1043 0.1098 0.1133 0.0940 0.0931 0.0870 0.0874 0.0870
va: 2.1185 2.0204 3.7666 3.9275 3.8693 3.8735 3.8223 3.9031 3.9477 3.9276 3.9315 3.8602 3.9077 3.6986 3.9174 3.7774 4.1695 3.8502 3.9696 1.0131 1.0069 1.0074 1.0059 1.0121 1.0101 1.0121 1.0190 1.0113 1.0061 1.0014 1.0045 1.0046 1.0053 1.0040 1.0019 1.0055 1.0033 1.0052 0.9926 1.0209 0.9958 0.9965 1.0373 1.0330 0.9961 0.9964 1.0034 1.0034 1.0069
dispcorr: -0.020150452 hartree
energy: -816.448969404852
dipole: -19.21638 18.53138 -0.68499 19.75594 -18.94993 0.80601 -3.82190 3.30233 -0.51958
magnitude: 1.17849 au
magnitude: 2.99547 debye
