program: Orca
programVersion: 5.0.2
elementType: O O C C C C C C C C C C C C C C C C C H H H H H H H H H H H H H H H H H H H H H H H H H H H H H H
charge: 0
multiplicity: 1
keywords: wb97x-d3
keywords: def2-TZVPP
keywords: def2/J RIJCOSX
keywords: DEFGRID2
keywords: scfconv7
keywords: smallprint printgap noloewdin
keywords: NOSOSCF
formula: C17H30O2
InChI: InChI=1/C17H30O2/c1-6-19-17(18)13-16(5)12-8-11-15(4)10-7-9-14(2)3/h8,12-15H,6-7,9-11H2,1-5H3
49 atoms
O  3.966643 -3.383844 1.305393
O  4.379354 -1.228894 0.884432
C  -3.225251 -0.207421 0.296303
C  -3.062231 1.290562 0.559453
C  -3.298713 2.190072 -0.648364
C  -3.249226 3.667374 -0.270798
C  -3.453941 4.662081 -1.418226
C  -2.296089 -0.741127 -0.812963
C  -3.042628 -0.998283 1.585826
C  -2.352097 4.567536 -2.468213
C  -4.830609 4.532165 -2.061956
C  -0.853719 -0.458232 -0.561805
C  0.03652 -1.372665 -0.161701
C  1.445473 -1.1093 0.123564
C  1.937919 0.289407 -0.071966
C  2.184968 -2.156365 0.549745
C  3.605909 -2.161382 0.910277
C  5.332016 -3.610012 1.677862
C  6.223709 -3.833387 0.477325
H  -4.249794 -0.374319 -0.056258
H  -2.064822 1.485709 0.970672
H  -3.765587 1.572576 1.350573
H  -4.271267 1.947151 -1.088971
H  -2.552359 1.980887 -1.420495
H  -4.006358 3.859717 0.497635
H  -2.283578 3.877359 0.202997
H  -3.395011 5.661902 -0.972909
H  -2.584222 -0.291808 -1.767826
H  -2.45537 -1.817967 -0.914372
H  -3.203427 -2.06675 1.427524
H  -2.038942 -0.874153 1.99827
H  -3.750901 -0.670599 2.3494
H  -2.390612 3.62329 -3.015301
H  -1.360402 4.647151 -2.017109
H  -2.44011 5.368931 -3.20481
H  -5.004664 5.333502 -2.783041
H  -4.942313 3.587359 -2.598253
H  -5.628528 4.584143 -1.317731
H  -0.535873 0.570038 -0.705525
H  -0.296027 -2.398211 -0.024019
H  2.993177 0.405587 0.13988
H  1.384808 0.975873 0.572404
H  1.758997 0.611891 -1.099351
H  1.688865 -3.115494 0.647109
H  5.301606 -4.504434 2.299211
H  5.699476 -2.789843 2.296827
H  7.231379 -4.070378 0.821468
H  5.874331 -4.671547 -0.126638
H  6.291766 -2.951971 -0.159416
elementType: O C H
totalener: -816.42728669 hartree
nucrepener: 1396.11591517 hartree
electener: -2212.54320185 hartree
oneelecener: -3877.46866284 hartree
twoeener: 1664.92546099 hartree
cpcmener: -0.01629848 hartree
kineticenergy: 812.44455185 hartree
xcener: -82.313398489819 hartree
chargesum: 0.0000000
charge: -0.292742 -0.486323 0.114664 -0.200345 -0.143324 -0.155775 0.076564 -0.144349 -0.334342 -0.316907 -0.316201 -0.123196 -0.172727 0.025724 -0.267011 -0.177660 0.467538 0.039821 -0.255826 0.044094 0.075247 0.078090 0.078790 0.067009 0.074781 0.075328 0.037689 0.101407 0.092358 0.095026 0.085271 0.094212 0.078028 0.092919 0.094688 0.094387 0.079898 0.091771 0.124664 0.112862 0.110490 0.104351 0.104591 0.113251 0.106187 0.085857 0.093179 0.087466 0.088523
qa: -0.2927 -0.4863 0.1147 -0.2003 -0.1433 -0.1558 0.0766 -0.1443 -0.3343 -0.3169 -0.3162 -0.1232 -0.1727 0.0257 -0.2670 -0.1777 0.4675 0.0398 -0.2558 0.0441 0.0752 0.0781 0.0788 0.0670 0.0748 0.0753 0.0377 0.1014 0.0924 0.0950 0.0853 0.0942 0.0780 0.0929 0.0947 0.0944 0.0799 0.0918 0.1247 0.1129 0.1105 0.1044 0.1046 0.1133 0.1062 0.0859 0.0932 0.0875 0.0885
va: 2.1181 2.0140 3.7636 3.8851 3.8605 3.8852 3.8221 3.9307 3.9604 3.9433 3.9413 3.8444 3.9119 3.6907 3.9188 3.7751 4.1751 3.8521 3.9166 1.0160 1.0029 1.0128 1.0063 0.9980 1.0103 1.0096 1.0105 1.0015 1.0132 1.0039 0.9985 1.0059 0.9986 1.0030 1.0048 1.0041 0.9978 1.0027 0.9915 1.0232 1.0371 0.9964 0.9962 1.0335 0.9954 1.0130 1.0074 1.0042 1.0139
dispcorr: -0.019899404 hartree
energy: -816.447186090334
dipole: -23.48120 22.38755 -1.09365 18.16766 -18.42577 -0.25811 -7.15828 6.98741 -0.17087
magnitude: 1.13661 au
magnitude: 2.88904 debye
