program: Orca
programVersion: 5.0.2
elementType: O O C C C C C C C C C C C C C C C C C H H H H H H H H H H H H H H H H H H H H H H H H H H H H H H
charge: 0
multiplicity: 1
keywords: wb97x-d3
keywords: def2-TZVPP
keywords: def2/J RIJCOSX
keywords: DEFGRID2
keywords: scfconv7
keywords: smallprint printgap noloewdin
keywords: NOSOSCF
formula: C17H30O2
InChI: InChI=1/C17H30O2/c1-6-19-17(18)13-16(5)12-8-11-15(4)10-7-9-14(2)3/h8,12-15H,6-7,9-11H2,1-5H3
49 atoms
O  3.897274 -1.323128 0.98466
O  3.416338 -1.658247 -1.167957
C  -4.176328 -0.353687 0.214004
C  -3.641644 1.06884 0.418283
C  -2.55745 1.521281 -0.554759
C  -2.099376 2.951587 -0.293215
C  -0.920952 3.413618 -1.154015
C  -3.221909 -1.44508 0.731086
C  -5.527848 -0.506553 0.904913
C  -0.682139 4.907704 -0.966428
C  0.354381 2.635068 -0.844823
C  -1.9464 -1.575718 -0.027075
C  -0.725237 -1.539729 0.517241
C  0.527021 -1.62516 -0.22907
C  0.43561 -1.818747 -1.709161
C  1.669163 -1.494037 0.480745
C  3.044554 -1.507255 -0.023802
C  5.298609 -1.295658 0.685983
C  6.039887 -1.066209 1.978774
H  -4.325942 -0.517327 -0.860643
H  -3.272404 1.162815 1.446727
H  -4.482169 1.767606 0.341823
H  -2.934109 1.442483 -1.580754
H  -1.703437 0.847213 -0.493869
H  -2.945816 3.629319 -0.45175
H  -1.823213 3.058847 0.763184
H  -1.179408 3.241786 -2.206306
H  -3.748549 -2.404549 0.659062
H  -3.018491 -1.281918 1.794065
H  -5.444228 -0.328672 1.980141
H  -6.25627 0.204608 0.511389
H  -5.939638 -1.508454 0.768636
H  -1.565777 5.492327 -1.230795
H  0.143919 5.264256 -1.585406
H  -0.434904 5.138531 0.073352
H  1.188037 2.982734 -1.458575
H  0.645005 2.75976 0.20205
H  0.248509 1.5646 -1.029139
H  -2.053819 -1.708761 -1.100247
H  -0.635532 -1.396822 1.590715
H  -0.126486 -2.726154 -1.938024
H  1.401716 -1.889072 -2.192914
H  -0.111568 -0.989962 -2.163691
H  1.580701 -1.350038 1.551716
H  5.510732 -0.496296 -0.028079
H  5.600027 -2.240805 0.228444
H  5.768133 -0.114265 2.43638
H  5.853845 -1.863681 2.698885
H  7.111175 -1.043523 1.777898
elementType: O C H
totalener: -816.42785816 hartree
nucrepener: 1444.43796630 hartree
electener: -2260.86582446 hartree
oneelecener: -3974.26035844 hartree
twoeener: 1713.39453398 hartree
cpcmener: -0.01700737 hartree
kineticenergy: 812.44246628 hartree
xcener: -82.310695026428 hartree
chargesum: 0.0000000
charge: -0.285977 -0.486812 0.086411 -0.189524 -0.048699 -0.175390 0.079921 -0.115278 -0.301544 -0.295985 -0.282374 -0.127905 -0.142220 -0.009920 -0.257906 -0.170034 0.467925 0.040651 -0.251765 0.037867 0.066643 0.073848 0.064577 0.006395 0.070724 0.064004 0.024180 0.093848 0.079656 0.085740 0.088659 0.089393 0.086740 0.089359 0.080465 0.092973 0.083279 0.068990 0.129767 0.109221 0.109675 0.111058 0.100199 0.111818 0.092617 0.093251 0.087432 0.087031 0.087015
qa: -0.2860 -0.4868 0.0864 -0.1895 -0.0487 -0.1754 0.0799 -0.1153 -0.3015 -0.2960 -0.2824 -0.1279 -0.1422 -0.0099 -0.2579 -0.1700 0.4679 0.0407 -0.2518 0.0379 0.0666 0.0738 0.0646 0.0064 0.0707 0.0640 0.0242 0.0938 0.0797 0.0857 0.0887 0.0894 0.0867 0.0894 0.0805 0.0930 0.0833 0.0690 0.1298 0.1092 0.1097 0.1111 0.1002 0.1118 0.0926 0.0933 0.0874 0.0870 0.0870
va: 2.1186 2.0188 3.7659 3.9291 3.8283 3.9202 3.8240 3.9135 3.9331 3.9276 3.9329 3.8865 3.8973 3.6891 3.9115 3.7634 4.1653 3.8499 3.9695 1.0226 1.0096 1.0071 1.0164 1.0505 1.0116 1.0107 1.0173 1.0042 1.0151 1.0005 1.0051 1.0050 1.0054 1.0052 1.0031 1.0058 1.0043 1.0033 1.0026 1.0238 0.9974 1.0373 0.9937 1.0336 0.9965 0.9964 1.0033 1.0034 1.0070
dispcorr: -0.020765554 hartree
energy: -816.448623713656
dipole: -16.03445 15.06720 -0.96725 16.00103 -15.85261 0.14842 0.56331 0.06601 0.62933
magnitude: 1.16347 au
magnitude: 2.95729 debye
