program: Orca
programVersion: 5.0.2
elementType: O O C C C C C C C C C C C C C C C C C H H H H H H H H H H H H H H H H H H H H H H H H H H H H H H
charge: 0
multiplicity: 1
keywords: wb97x-d3
keywords: def2-TZVPP
keywords: def2/J RIJCOSX
keywords: DEFGRID2
keywords: scfconv7
keywords: smallprint printgap noloewdin
keywords: NOSOSCF
formula: C17H30O2
InChI: InChI=1/C17H30O2/c1-6-19-17(18)13-16(5)12-8-11-15(4)10-7-9-14(2)3/h8,12-15H,6-7,9-11H2,1-5H3
49 atoms
O  4.383445 -1.314576 0.160977
O  3.402331 -3.032499 1.201422
C  -3.616424 0.065089 -0.240249
C  -3.011224 0.906761 0.885182
C  -2.152019 2.094106 0.4561
C  -2.89431 3.12713 -0.383286
C  -2.074089 4.366105 -0.752373
C  -2.551397 -0.488495 -1.204444
C  -4.487636 -1.044707 0.339465
C  -2.841322 5.228853 -1.748103
C  -1.687758 5.19185 0.470326
C  -1.515543 -1.327902 -0.535712
C  -0.20393 -1.06653 -0.562146
C  0.830789 -1.861111 0.096093
C  0.3901 -3.061889 0.870812
C  2.104945 -1.434536 -0.044072
C  3.318473 -2.037176 0.515126
C  5.681453 -1.744588 0.589511
C  6.24864 -2.828701 -0.298594
H  -4.269404 0.705707 -0.842181
H  -2.413338 0.254353 1.531386
H  -3.827985 1.276643 1.514622
H  -1.271358 1.74639 -0.09347
H  -1.76459 2.565503 1.363289
H  -3.241213 2.657584 -1.309544
H  -3.799767 3.44556 0.148523
H  -1.151726 4.027489 -1.240342
H  -2.07184 0.33147 -1.744844
H  -3.063899 -1.095569 -1.959564
H  -3.923732 -1.712876 0.994252
H  -5.302727 -0.627999 0.934407
H  -4.936743 -1.654749 -0.447086
H  -2.266485 6.108447 -2.045542
H  -3.782003 5.583505 -1.318175
H  -3.084986 4.674319 -2.656821
H  -1.071749 4.632835 1.175997
H  -1.119164 6.078834 0.182962
H  -2.576622 5.533743 1.007989
H  -1.876783 -2.199491 0.001989
H  0.141268 -0.192408 -1.108147
H  -0.309834 -2.766049 1.654883
H  1.209278 -3.597492 1.334015
H  -0.144798 -3.756008 0.219574
H  2.273725 -0.541476 -0.635418
H  5.653255 -2.061988 1.633282
H  6.298539 -0.848509 0.534541
H  6.294245 -2.507226 -1.339564
H  7.266311 -3.055226 0.022374
H  5.672658 -3.751999 -0.245479
elementType: O C H
totalener: -816.42752839 hartree
nucrepener: 1411.19073938 hartree
electener: -2227.61826777 hartree
oneelecener: -3907.64556796 hartree
twoeener: 1680.02730019 hartree
cpcmener: -0.01653979 hartree
kineticenergy: 812.43917208 hartree
xcener: -82.312935155825 hartree
chargesum: -0.0000000
charge: -0.292805 -0.486690 0.078148 -0.208327 -0.129408 -0.167940 0.065414 -0.120208 -0.313091 -0.290203 -0.302628 -0.150541 -0.149004 0.013848 -0.266542 -0.176585 0.469442 0.039263 -0.255320 0.049756 0.083340 0.083237 0.066207 0.083087 0.070260 0.071308 0.028186 0.086567 0.099256 0.079805 0.093422 0.094396 0.089336 0.079987 0.086481 0.090177 0.090284 0.081759 0.130698 0.111948 0.104685 0.109660 0.105332 0.113296 0.085074 0.106402 0.087018 0.093428 0.088780
qa: -0.2928 -0.4867 0.0781 -0.2083 -0.1294 -0.1679 0.0654 -0.1202 -0.3131 -0.2902 -0.3026 -0.1505 -0.1490 0.0138 -0.2665 -0.1766 0.4694 0.0393 -0.2553 0.0498 0.0833 0.0832 0.0662 0.0831 0.0703 0.0713 0.0282 0.0866 0.0993 0.0798 0.0934 0.0944 0.0893 0.0800 0.0865 0.0902 0.0903 0.0818 0.1307 0.1119 0.1047 0.1097 0.1053 0.1133 0.0851 0.1064 0.0870 0.0934 0.0888
va: 2.1172 2.0136 3.7616 3.9237 3.8729 3.8704 3.8260 3.9082 3.9484 3.9264 3.9310 3.8563 3.9114 3.7022 3.9168 3.7715 4.1751 3.8539 3.9153 1.0124 1.0062 1.0073 1.0065 1.0128 1.0096 1.0123 1.0181 1.0094 1.0061 1.0010 1.0045 1.0041 1.0053 1.0033 1.0053 1.0034 1.0044 1.0028 0.9925 1.0215 0.9963 1.0370 0.9958 1.0339 1.0131 0.9954 1.0043 1.0072 1.0139
dispcorr: -0.020105321 hartree
energy: -816.447633706223
dipole: -20.98891 20.31349 -0.67542 18.11351 -17.42303 0.69048 -2.59271 2.00302 -0.58968
magnitude: 1.13167 au
magnitude: 2.87647 debye
