program: Orca
programVersion: 5.0.2
elementType: O O C C C C C C C C C C C C C C C C C H H H H H H H H H H H H H H H H H H H H H H H H H H H H H H
charge: 0
multiplicity: 1
keywords: wb97x-d3
keywords: def2-TZVPP
keywords: def2/J RIJCOSX
keywords: DEFGRID2
keywords: scfconv7
keywords: smallprint printgap noloewdin
keywords: NOSOSCF
formula: C17H30O2
InChI: InChI=1/C17H30O2/c1-6-19-17(18)13-16(5)12-8-11-15(4)10-7-9-14(2)3/h8,12-15H,6-7,9-11H2,1-5H3
49 atoms
O  3.713943 -0.836982 1.030507
O  3.362497 -1.764424 -0.97378
C  -4.176312 -0.313542 -0.282058
C  -3.38074 0.914992 -0.733743
C  -2.920748 1.863295 0.372213
C  -1.897895 2.883757 -0.130713
C  -0.471718 2.339827 -0.275327
C  -3.343656 -1.2772 0.582288
C  -5.464562 0.060129 0.440987
C  0.366163 3.244055 -1.171738
C  0.2023 2.175695 1.082841
C  -2.055675 -1.650437 -0.067792
C  -0.85345 -1.404858 0.46343
C  0.432198 -1.65569 -0.181624
C  0.417542 -2.266038 -1.546399
C  1.530916 -1.277487 0.507268
C  2.92943 -1.341545 0.07602
C  5.126963 -0.769145 0.803133
C  5.519908 0.446678 -0.005076
H  -4.452131 -0.858283 -1.192806
H  -3.993226 1.481786 -1.443135
H  -2.512195 0.575466 -1.307178
H  -2.499096 1.302456 1.211865
H  -3.787157 2.392314 0.778125
H  -2.2393 3.271761 -1.097213
H  -1.871079 3.74828 0.541711
H  -0.521601 1.353112 -0.751366
H  -3.940148 -2.180297 0.753341
H  -3.153261 -0.840278 1.566425
H  -5.267419 0.562546 1.390235
H  -6.079541 0.729419 -0.164208
H  -6.06416 -0.825366 0.661701
H  -0.053412 3.311847 -2.177625
H  1.389619 2.875073 -1.26768
H  0.421059 4.259535 -0.769868
H  0.324458 3.14555 1.573552
H  -0.370904 1.539092 1.759367
H  1.195913 1.733564 0.98423
H  -2.133874 -2.110889 -1.049254
H  -0.809052 -0.94168 1.445468
H  -0.141431 -3.203475 -1.535471
H  1.407963 -2.468144 -1.935234
H  -0.094581 -1.603928 -2.248026
H  1.380287 -0.848553 1.491334
H  5.484077 -1.688234 0.335515
H  5.561616 -0.716362 1.800654
H  6.608143 0.502643 -0.057215
H  5.141345 0.406723 -1.026027
H  5.16365 1.365636 0.461939
elementType: O C H
totalener: -816.42607441 hartree
nucrepener: 1500.22280884 hartree
electener: -2316.64888325 hartree
oneelecener: -4085.84674127 hartree
twoeener: 1769.19785802 hartree
cpcmener: -0.01641595 hartree
kineticenergy: 812.44480931 hartree
xcener: -82.314966821293 hartree
chargesum: 0.0000000
charge: -0.292630 -0.485891 0.068021 -0.177783 -0.153383 -0.179022 0.086789 -0.138769 -0.327200 -0.294878 -0.326566 -0.092431 -0.197898 0.025467 -0.264260 -0.189873 0.478646 0.036757 -0.255963 0.052806 0.087456 0.086006 0.070365 0.086906 0.070479 0.080244 0.014236 0.097482 0.079455 0.085226 0.094059 0.094889 0.087279 0.089340 0.085138 0.097811 0.088572 0.090415 0.127938 0.114354 0.105420 0.108283 0.106776 0.116790 0.086594 0.105922 0.094452 0.088930 0.087245
qa: -0.2926 -0.4859 0.0680 -0.1778 -0.1534 -0.1790 0.0868 -0.1388 -0.3272 -0.2949 -0.3266 -0.0924 -0.1979 0.0255 -0.2643 -0.1899 0.4786 0.0368 -0.2560 0.0528 0.0875 0.0860 0.0704 0.0869 0.0705 0.0802 0.0142 0.0975 0.0795 0.0852 0.0941 0.0949 0.0873 0.0893 0.0851 0.0978 0.0886 0.0904 0.1279 0.1144 0.1054 0.1083 0.1068 0.1168 0.0866 0.1059 0.0945 0.0889 0.0872
va: 2.1117 2.0161 3.8042 3.8520 3.8769 3.9375 3.7547 3.9329 3.9526 3.9253 3.9326 3.8270 3.9077 3.6280 3.9198 3.7384 4.1745 3.8575 3.9167 1.0145 1.0091 1.0064 1.0045 1.0067 1.0059 1.0100 1.0291 1.0074 1.0082 0.9962 1.0027 1.0042 1.0048 1.0044 1.0029 1.0102 1.0014 1.0012 1.0010 1.0199 0.9964 1.0359 0.9957 1.0298 1.0124 0.9954 1.0076 1.0134 1.0038
dispcorr: -0.023830419 hartree
energy: -816.449904825019
dipole: -14.88331 13.91601 -0.96730 15.38836 -15.05763 0.33073 -1.06442 1.55256 0.48815
magnitude: 1.13285 au
magnitude: 2.87947 debye
