program: Gaussian 09
title: 000006603
version: EM64L-G09RevD.01
frameworkgroup: C1[X(C10H21N)]
method: RPBEPBE
basis: SDD
operation: Freq
keyword: #pfreq=noraman
keyword: PBEPBE/SDD
title: #p freq=noraman PBEPBE/SDD
converged: YES YES NO NO
title: Mulliken charges:
elementType: N C C C C C C C C C C H H H H H H H H H H H H H H H H H H H H H
charge: -0.182445 0.369097 0.369103 -0.408564 -0.408572 -0.468957 -0.746856 -0.779920 -0.779928 -0.746860 -0.696612 0.188784 0.201830 0.201833 0.188785 0.213580 0.199365 0.214536 0.214221 0.219955 0.214018 0.235330 0.211375 0.211374 0.235332 0.214024 0.214222 0.214537 0.219958 0.241172 0.185108 0.241174
chargesum: 0.00000
title: Mulliken charges with hydrogens summed into heavy atoms:
elementType: N C C C C C C C C C C
charge: -0.182445 0.369097 0.369103 -0.017950 -0.017954 -0.056011 -0.098144 -0.119197 -0.119197 -0.098143 -0.029158
polarizability: 1.23336910e+02 -5.62806033e-05 1.12531806e+02 -2.92250676e-05 2.28706606e-02 1.01710160e+02
1716.lowfreq: -25.2425 -20.0241 -14.6641 -0.0003 -0.0002 0.0003 88.2195 116.4813 168.9022
frequency: 88.2195 116.4299 168.7751 173.2847 222.1934 238.1197 269.5743 275.8310 288.8298 292.9560 309.5458 326.9718 333.7668 399.8191 399.9738 423.4090 437.6901 457.9948 491.1862 509.3565 561.1237 610.6362 742.1394 769.4218 843.1033 862.9471 897.0739 905.6279 909.2344 942.4911 943.0064 975.4398 981.2199 988.2638 1024.3701 1075.8036 1082.0268 1108.5995 1113.7539 1120.7401 1170.7499 1175.1625 1200.6570 1208.1840 1232.6516 1261.1698 1263.8064 1293.2496 1341.4634 1344.7875 1344.8210 1360.0171 1365.0861 1378.5946 1382.3717 1434.3296 1446.0106 1452.9626 1459.5202 1461.1437 1465.8368 1466.5524 1474.8045 1477.2077 1485.8082 1488.8691 1495.1104 1498.2768 1501.6834 2868.8127 2970.3993 2971.4745 2976.4211 2977.0104 2979.0151 2980.4444 2984.0846 3025.4427 3030.1880 3042.7232 3048.1681 3064.4380 3066.6365 3069.6861 3072.4587 3082.6636 3086.5136 3086.5363 3092.8157 3100.1387
redmass: 2.5758 1.9955 1.0721 1.1341 1.4974 1.5612 1.1593 2.1200 1.2566 2.3411 2.1696 2.6182 1.9924 2.3931 1.8350 2.0001 3.0355 2.5989 2.6495 2.9180 2.1598 3.0949 2.9426 2.2551 1.5452 2.1791 1.9183 1.5178 1.6698 1.7915 1.7781 1.4944 1.5566 1.2785 1.6579 1.4283 1.5249 1.3773 3.9274 1.9832 1.8086 2.4182 3.5971 1.9179 2.0335 2.1006 3.0978 1.2827 1.4159 1.6203 1.4995 1.2050 1.2034 1.2055 1.2143 1.1347 1.0813 1.0753 1.0504 1.0602 1.0620 1.0700 1.0568 1.0767 1.0513 1.0583 1.0582 1.0474 1.0553 1.0596 1.0578 1.0577 1.0351 1.0363 1.0545 1.0372 1.0455 1.0973 1.1021 1.1030 1.0700 1.0993 1.0982 1.0989 1.0973 1.1000 1.1003 1.1000 1.0972 1.0982
irintensity: 0.2384 0.0536 0.2320 0.4166 1.4710 2.7584 0.0027 0.4342 0.5478 0.0645 0.0693 0.4759 0.4416 0.3621 1.4048 0.2814 0.2636 0.8344 0.0002 10.5979 1.1233 6.3711 2.3855 1.0337 0.8979 0.8880 2.1042 3.0395 0.9715 6.5324 17.2902 2.2446 12.0252 7.2249 11.3089 12.2653 4.9697 3.0120 10.9464 60.7576 0.1459 17.9966 9.9916 4.1490 7.6996 32.5253 33.5616 4.1298 3.9794 6.9370 0.0596 0.0110 49.2851 37.2639 9.6098 6.9611 4.0485 1.0092 2.8026 2.8055 18.2019 3.1635 0.9385 21.7034 7.6078 3.8539 13.8399 9.6318 6.6968 100.0513 23.9927 17.8492 10.8246 47.1311 38.6419 67.2461 14.3894 44.0054 28.1533 64.8355 43.2589 21.8182 3.2901 45.2706 103.5159 4.0081 48.0316 35.3479 41.7318 30.9176
temp: 298.150 k
press: 1.00000 atm
elementType: 7 6 6 6 6 6 6 6 6 6 6 1 1 1 1 1 1 1 1 1 1 1 1 1 1 1 1 1 1 1 1 1
symmnumber: 1
zpe: 766734.0 jmol-1
zpe.correction: 0.292034 hartree
zpe.thermalcorrener: 0.304848 hartree
zpe.thermalcorrenthalpy: 0.305793 hartree
zpe.thermalcorrgfe: 0.255450 hartree
zpe.sumelectzpe: -447.472142 hartree
zpe.sumelectthermal: -447.459327 hartree
zpe.sumelectthermalent: -447.458383 hartree
zpe.sumelectthermalfe: -447.508725 hartree
dipole: 0.0000 0.0877 0.4194
dipole: 0.4285
quadrupole: -70.6106 -69.9115 -73.5075
quadrupole: 0.0001 0.0000 -0.4769
quadrupole: 0.7326 1.4317 -2.1643 0.0001 0.0000 -0.4769
hfenergy: -447.7641756 hartree
pointgroup: C01 [X(C10H21N1)]
dipole: -0.0000019 -0.0274164 0.1663382 debye
polarizability: 123.3369099|0.0008489|112.5101513|-0.0002568|-0.4841454|101.7318152 unknown
InChI: InChI=1S/C10H21N/c1-9(2)7-6-8-10(3,4)11(9)5/h6-8H2,1-5H3
charge 0 multiplicity 1
32 atoms
N  -0.000059 0.737133 -0.378519
C  1.306435 0.072191 -0.007242
C  -1.306457 0.072012 -0.007201
C  1.2515 -1.429127 -0.414598
C  -1.251322 -1.429301 -0.414554
C  0.000148 -2.159118 0.101543
C  1.693151 0.200163 1.504148
C  2.450333 0.715084 -0.84459
C  -2.450484 0.714714 -0.844517
C  -1.693144 0.19993 1.5042
C  -0.000132 2.201867 -0.182745
H  2.173368 -1.921227 -0.047675
H  1.264739 -1.485924 -1.521839
H  -1.264594 -1.486103 -1.521794
H  -2.173108 -1.921529 -0.047597
H  0.000215 -3.208794 -0.250807
H  0.00017 -2.202508 1.20855
H  1.060335 -0.425057 2.155963
H  2.743233 -0.115075 1.652331
H  1.60766 1.247337 1.847534
H  3.341471 0.061277 -0.812201
H  2.132717 0.822547 -1.897077
H  2.758606 1.704866 -0.462213
H  -2.758988 1.7044 -0.462078
H  -2.132877 0.822322 -1.896993
H  -3.341478 0.060708 -0.812188
H  -2.743163 -0.115496 1.652425
H  -1.06019 -0.425167 2.1560
H  -1.607831 1.247125 1.84757
H  0.883822 2.645893 -0.667778
H  -0.000073 2.535564 0.884094
H  -0.884201 2.645793 -0.667651
