program: Orca
programVersion: 5.0.2
elementType: O O C C C C C C C C C C C C C C C C C H H H H H H H H H H H H H H H H H H H H H H H H H H H H H H
charge: 0
multiplicity: 1
keywords: wb97x-d3
keywords: def2-TZVPP
keywords: def2/J RIJCOSX
keywords: DEFGRID2
keywords: scfconv7
keywords: smallprint printgap noloewdin
keywords: NOSOSCF
formula: C17H30O2
InChI: InChI=1/C17H30O2/c1-6-19-17(18)13-16(5)12-8-11-15(4)10-7-9-14(2)3/h8,12-15H,6-7,9-11H2,1-5H3
49 atoms
O  3.820621 -1.543978 -0.683557
O  3.263706 -1.465476 1.479299
C  -4.228582 -0.439901 -0.459833
C  -3.632693 0.866988 -1.000752
C  -2.60478 1.568221 -0.116235
C  -1.938583 2.743202 -0.822416
C  -0.800068 3.395739 -0.034511
C  -3.299304 -1.65631 -0.645883
C  -4.730925 -0.311067 0.973783
C  0.400057 2.464511 0.109498
C  -0.375434 4.702557 -0.695579
C  -2.053846 -1.6469 0.172814
C  -0.815811 -1.70078 -0.331452
C  0.412543 -1.645439 0.456519
C  0.274672 -1.575316 1.943921
C  1.577378 -1.634737 -0.228586
C  2.93501 -1.537367 0.31488
C  5.213298 -1.414581 -0.373733
C  5.618338 0.026651 -0.161112
H  -5.101302 -0.659115 -1.084253
H  -4.453922 1.564564 -1.197838
H  -3.180657 0.660491 -1.977555
H  -1.844367 0.854525 0.202597
H  -3.083973 1.930547 0.798549
H  -1.547288 2.413976 -1.793061
H  -2.699155 3.499573 -1.046875
H  -1.172446 3.630303 0.97041
H  -3.0454 -1.75451 -1.70484
H  -3.874242 -2.551473 -0.379824
H  -5.455741 0.500883 1.061632
H  -5.228412 -1.227377 1.298711
H  -3.930089 -0.106376 1.685848
H  0.810048 2.201619 -0.869699
H  0.149515 1.532304 0.619153
H  1.200811 2.935532 0.683202
H  -0.020924 4.53107 -1.715556
H  -1.203533 5.412225 -0.751234
H  0.434513 5.186567 -0.145882
H  -2.189591 -1.593252 1.248655
H  -0.69259 -1.75291 -1.409947
H  -0.298288 -2.428877 2.310803
H  -0.281523 -0.679807 2.229642
H  1.225531 -1.559044 2.461458
H  1.524115 -1.687196 -1.31018
H  5.726508 -1.828124 -1.241179
H  5.473393 -2.03081 0.488511
H  5.15242 0.462562 0.722249
H  6.699363 0.076553 -0.02329
H  5.366394 0.641824 -1.025659
elementType: O C H
totalener: -816.42446036 hartree
nucrepener: 1472.26667828 hartree
electener: -2288.69113864 hartree
oneelecener: -4030.02476501 hartree
twoeener: 1741.33362637 hartree
cpcmener: -0.01658298 hartree
kineticenergy: 812.44573895 hartree
xcener: -82.314803687659 hartree
chargesum: 0.0000000
charge: -0.292490 -0.488135 0.087421 -0.195731 -0.091896 -0.160784 0.085293 -0.125237 -0.327786 -0.289323 -0.296662 -0.130054 -0.156418 -0.007212 -0.262269 -0.180179 0.480273 0.038144 -0.254622 0.052519 0.085558 0.070341 0.020992 0.073340 0.064187 0.071117 0.023625 0.082209 0.098715 0.098641 0.099595 0.077276 0.082726 0.071546 0.094377 0.080974 0.087456 0.087995 0.137275 0.109477 0.111367 0.101463 0.112160 0.112270 0.105941 0.085569 0.088539 0.093659 0.086756
qa: -0.2925 -0.4881 0.0874 -0.1957 -0.0919 -0.1608 0.0853 -0.1252 -0.3278 -0.2893 -0.2967 -0.1301 -0.1564 -0.0072 -0.2623 -0.1802 0.4803 0.0381 -0.2546 0.0525 0.0856 0.0703 0.0210 0.0733 0.0642 0.0711 0.0236 0.0822 0.0987 0.0986 0.0996 0.0773 0.0827 0.0715 0.0944 0.0810 0.0875 0.0880 0.1373 0.1095 0.1114 0.1015 0.1122 0.1123 0.1059 0.0856 0.0885 0.0937 0.0868
va: 2.1173 2.0111 3.7843 3.9520 3.8226 3.9045 3.8203 3.9232 3.9592 3.9350 3.9280 3.8513 3.8924 3.6787 3.9083 3.7514 4.1645 3.8554 3.9163 1.0123 1.0051 1.0096 1.0330 1.0100 1.0124 1.0113 1.0180 1.0158 1.0037 1.0017 1.0040 0.9949 1.0039 1.0023 1.0067 1.0029 1.0050 1.0055 0.9916 1.0238 0.9967 0.9936 1.0369 1.0346 0.9953 1.0128 1.0135 1.0073 1.0045
dispcorr: -0.022113339 hartree
energy: -816.446573698247
dipole: -14.58141 13.59630 -0.98511 17.36088 -17.26345 0.09743 -0.93771 0.25629 -0.68143
magnitude: 1.20178 au
magnitude: 3.05469 debye
