program: Orca
programVersion: 5.0.2
elementType: O O C C C C C C C C C C C C C C C C C H H H H H H H H H H H H H H H H H H H H H H H H H H H H H H
charge: 0
multiplicity: 1
keywords: wb97x-d3
keywords: def2-TZVPP
keywords: def2/J RIJCOSX
keywords: DEFGRID2
keywords: scfconv7
keywords: smallprint printgap noloewdin
keywords: NOSOSCF
formula: C17H30O2
InChI: InChI=1/C17H30O2/c1-6-19-17(18)13-16(5)12-8-11-15(4)10-7-9-14(2)3/h8,12-15H,6-7,9-11H2,1-5H3
49 atoms
O  4.365676 -1.842382 1.065421
O  3.787317 -2.565705 -0.963197
C  -3.56739 -0.190187 0.021515
C  -2.790432 1.102183 -0.232136
C  -3.439659 2.04275 -1.242156
C  -2.544188 3.212402 -1.645213
C  -2.137896 4.162735 -0.516139
C  -2.735902 -1.180851 0.85301
C  -4.902766 0.071158 0.708002
C  -1.188676 5.232156 -1.04584
C  -3.348443 4.805678 0.15063
C  -1.502662 -1.634078 0.148454
C  -0.25987 -1.526184 0.630263
C  0.953322 -1.953488 -0.064484
C  0.795285 -2.534483 -1.433417
C  2.12239 -1.784227 0.590544
C  3.469871 -2.114566 0.116216
C  5.74639 -2.102471 0.782499
C  6.546428 -1.727891 2.004973
H  -3.769988 -0.66276 -0.94835
H  -1.786999 0.853676 -0.594866
H  -2.643715 1.613956 0.725951
H  -4.393066 2.418984 -0.861287
H  -3.685359 1.473153 -2.144792
H  -1.636931 2.812754 -2.112384
H  -3.049559 3.796067 -2.423486
H  -1.596893 3.589131 0.244992
H  -3.357427 -2.059711 1.061145
H  -2.484202 -0.738049 1.821714
H  -5.549226 0.717218 0.112768
H  -5.4484 -0.858779 0.880907
H  -4.758865 0.553336 1.678316
H  -0.853686 5.90022 -0.249738
H  -1.672686 5.847644 -1.808669
H  -0.298173 4.790087 -1.497736
H  -3.956093 5.349542 -0.577879
H  -3.99509 4.071242 0.633864
H  -3.043471 5.518498 0.919599
H  -1.664231 -2.074816 -0.831704
H  -0.11747 -1.081786 1.61174
H  0.296285 -1.819801 -2.090566
H  0.159666 -3.421288 -1.394948
H  1.735956 -2.8128 -1.891033
H  2.084098 -1.355861 1.585723
H  6.064901 -1.516739 -0.083186
H  5.882775 -3.158893 0.539327
H  6.252026 -2.314045 2.876071
H  7.601915 -1.923825 1.81475
H  6.443885 -0.6696 2.24722
elementType: O C H
totalener: -816.43003069 hartree
nucrepener: 1391.20358256 hartree
electener: -2207.63361325 hartree
oneelecener: -3867.67046065 hartree
twoeener: 1660.03684740 hartree
cpcmener: -0.01683245 hartree
kineticenergy: 812.43778802 hartree
xcener: -82.309898906127 hartree
chargesum: 0.0000000
charge: -0.286175 -0.485519 0.086786 -0.181588 -0.136748 -0.187891 0.066619 -0.114159 -0.317581 -0.296285 -0.302432 -0.138570 -0.153086 0.022386 -0.264443 -0.169772 0.460639 0.040717 -0.251537 0.039369 0.083126 0.068708 0.071607 0.078823 0.072565 0.078814 0.035040 0.095731 0.080127 0.093469 0.092083 0.083965 0.088964 0.081300 0.087859 0.084686 0.086616 0.090760 0.123576 0.111798 0.103516 0.105208 0.109283 0.113966 0.093798 0.092352 0.087075 0.087008 0.087444
qa: -0.2862 -0.4855 0.0868 -0.1816 -0.1367 -0.1879 0.0666 -0.1142 -0.3176 -0.2963 -0.3024 -0.1386 -0.1531 0.0224 -0.2644 -0.1698 0.4606 0.0407 -0.2515 0.0394 0.0831 0.0687 0.0716 0.0788 0.0726 0.0788 0.0350 0.0957 0.0801 0.0935 0.0921 0.0840 0.0890 0.0813 0.0879 0.0847 0.0866 0.0908 0.1236 0.1118 0.1035 0.1052 0.1093 0.1140 0.0938 0.0924 0.0871 0.0870 0.0874
va: 2.1184 2.0204 3.7766 3.8773 3.8779 3.9086 3.7902 3.9091 3.9465 3.9289 3.9331 3.8823 3.9121 3.6962 3.9182 3.7772 4.1699 3.8499 3.9696 1.0232 1.0076 1.0107 1.0030 1.0114 1.0094 1.0110 1.0156 1.0054 1.0158 1.0020 1.0049 1.0021 1.0049 1.0038 1.0048 1.0029 1.0009 1.0053 1.0050 1.0233 0.9966 0.9957 1.0371 1.0322 0.9964 0.9967 1.0035 1.0070 1.0032
dispcorr: -0.019094519 hartree
energy: -816.449125206543
dipole: -21.84201 20.99173 -0.85028 21.45438 -21.13793 0.31645 -0.58046 1.25003 0.66956
magnitude: 1.12758 au
magnitude: 2.86607 debye
