program: Orca
programVersion: 5.0.2
elementType: O O C C C C C C C C C C C C C C C C C H H H H H H H H H H H H H H H H H H H H H H H H H H H H H H
charge: 0
multiplicity: 1
keywords: wb97x-d3
keywords: def2-TZVPP
keywords: def2/J RIJCOSX
keywords: DEFGRID2
keywords: scfconv7
keywords: smallprint printgap noloewdin
keywords: NOSOSCF
formula: C17H30O2
InChI: InChI=1/C17H30O2/c1-6-19-17(18)13-16(5)12-8-11-15(4)10-7-9-14(2)3/h8,12-15H,6-7,9-11H2,1-5H3
49 atoms
O  4.106526 -1.324082 0.786513
O  3.496261 -2.746556 -0.819082
C  -3.923681 -0.458889 -0.21517
C  -3.195822 0.639532 -0.996942
C  -2.665351 1.803277 -0.166866
C  -1.918138 2.821826 -1.020225
C  -1.303431 3.987042 -0.242442
C  -3.019993 -1.147462 0.820626
C  -5.1974 0.046947 0.452499
C  -0.416971 4.826801 -1.155125
C  -2.36316 4.862516 0.418565
C  -1.794158 -1.737318 0.213636
C  -0.543297 -1.428829 0.572612
C  0.666633 -1.990965 -0.023162
C  0.492559 -2.985185 -1.126603
C  1.847252 -1.561705 0.473544
C  3.193319 -1.961919 0.053768
C  5.489584 -1.58138 0.512473
C  6.311272 -0.762689 1.47628
H  -4.216445 -1.222658 -0.945443
H  -3.878884 1.029292 -1.759556
H  -2.363415 0.190842 -1.549829
H  -1.987918 1.433758 0.610302
H  -3.493226 2.288725 0.35681
H  -1.119561 2.30189 -1.561767
H  -2.590702 3.221701 -1.789143
H  -0.669676 3.565515 0.547645
H  -3.598592 -1.950479 1.291758
H  -2.751283 -0.450561 1.618985
H  -4.986259 0.758122 1.253518
H  -5.850303 0.545464 -0.266878
H  -5.764583 -0.775872 0.892364
H  0.375546 4.226859 -1.607333
H  0.06126 5.643441 -0.610326
H  -0.997373 5.270736 -1.968237
H  -3.042596 5.285408 -0.326647
H  -2.968398 4.311857 1.140147
H  -1.906981 5.697024 0.955183
H  -1.966294 -2.458632 -0.580749
H  -0.3931 -0.702756 1.36733
H  -0.075182 -2.541917 -1.946941
H  -0.084538 -3.842184 -0.77379
H  1.430388 -3.351551 -1.524728
H  1.820369 -0.835299 1.278123
H  5.719613 -1.309135 -0.520441
H  5.700781 -2.646646 0.6319
H  6.128634 0.305882 1.358008
H  6.111125 -1.037456 2.512473
H  7.369549 -0.941375 1.284725
elementType: O C H
totalener: -816.42996353 hartree
nucrepener: 1412.31826520 hartree
electener: -2228.74822873 hartree
oneelecener: -3909.91833303 hartree
twoeener: 1681.17010430 hartree
cpcmener: -0.01694520 hartree
kineticenergy: 812.44276533 hartree
xcener: -82.311360587002 hartree
chargesum: 0.0000000
charge: -0.286126 -0.485894 0.089046 -0.163231 -0.159401 -0.157559 0.076020 -0.153720 -0.333293 -0.296696 -0.303378 -0.118605 -0.155549 0.015569 -0.263810 -0.171459 0.461161 0.041230 -0.252075 0.054304 0.085640 0.079115 0.064056 0.081753 0.069477 0.066179 0.026258 0.098508 0.083673 0.082130 0.095143 0.095827 0.088053 0.089013 0.080446 0.081852 0.088413 0.090722 0.126038 0.112288 0.104006 0.105441 0.108294 0.113807 0.093426 0.092305 0.087321 0.087099 0.087183
qa: -0.2861 -0.4859 0.0890 -0.1632 -0.1594 -0.1576 0.0760 -0.1537 -0.3333 -0.2967 -0.3034 -0.1186 -0.1555 0.0156 -0.2638 -0.1715 0.4612 0.0412 -0.2521 0.0543 0.0856 0.0791 0.0641 0.0818 0.0695 0.0662 0.0263 0.0985 0.0837 0.0821 0.0951 0.0958 0.0881 0.0890 0.0804 0.0819 0.0884 0.0907 0.1260 0.1123 0.1040 0.1054 0.1083 0.1138 0.0934 0.0923 0.0873 0.0871 0.0872
va: 2.1183 2.0199 3.7780 3.8890 3.8723 3.8825 3.8134 3.9269 3.9527 3.9301 3.9283 3.8554 3.9091 3.7063 3.9177 3.7770 4.1702 3.8503 3.9694 1.0138 1.0084 1.0080 1.0079 1.0014 1.0128 1.0126 1.0181 1.0057 1.0045 0.9969 1.0026 1.0044 1.0049 1.0051 1.0031 1.0029 1.0029 1.0046 1.0020 1.0220 0.9966 0.9959 1.0372 1.0326 0.9963 0.9967 1.0033 1.0034 1.0068
dispcorr: -0.019448722 hartree
energy: -816.449412252913
dipole: -18.77818 17.92373 -0.85445 20.84749 -20.34220 0.50529 -0.53168 1.09410 0.56243
magnitude: 1.14093 au
magnitude: 2.90002 debye
