program: Orca
programVersion: 5.0.2
elementType: O O C C C C C C C C C C C C C C C C C H H H H H H H H H H H H H H H H H H H H H H H H H H H H H H
charge: 0
multiplicity: 1
keywords: wb97x-d3
keywords: def2-TZVPP
keywords: def2/J RIJCOSX
keywords: DEFGRID2
keywords: scfconv7
keywords: smallprint printgap noloewdin
keywords: NOSOSCF
formula: C17H30O2
InChI: InChI=1/C17H30O2/c1-6-19-17(18)13-16(5)12-8-11-15(4)10-7-9-14(2)3/h8,12-15H,6-7,9-11H2,1-5H3
49 atoms
O  4.024511 -0.739993 0.553626
O  3.46295 -2.3123 -0.932028
C  -4.015149 -0.42432 -0.125397
C  -3.303215 0.612147 -1.000328
C  -2.669805 1.782594 -0.255127
C  -1.866256 2.68203 -1.188673
C  -1.106612 3.829321 -0.514248
C  -3.073618 -1.075534 0.902864
C  -5.23867 0.150125 0.57808
C  -2.040163 4.805874 0.192602
C  -0.023931 3.325054 0.435879
C  -1.841197 -1.635616 0.281078
C  -0.600262 -1.235538 0.578837
C  0.62217 -1.732721 -0.046751
C  0.477754 -2.789021 -1.094933
C  1.784521 -1.185151 0.370431
C  3.13885 -1.50189 -0.091354
C  5.418263 -0.914375 0.269617
C  6.012792 -2.086135 1.018158
H  -4.360772 -1.219447 -0.796491
H  -4.018958 0.997216 -1.734827
H  -2.526664 0.107086 -1.585092
H  -2.014864 1.404128 0.534461
H  -3.446397 2.365588 0.248066
H  -1.144873 2.064702 -1.735933
H  -2.537454 3.100034 -1.947379
H  -0.603395 4.381099 -1.316545
H  -3.622032 -1.884023 1.3991
H  -2.807702 -0.357605 1.683238
H  -5.789097 -0.627419 1.111814
H  -4.965472 0.913893 1.308751
H  -5.927703 0.607262 -0.135097
H  -2.824835 5.167046 -0.476174
H  -1.494149 5.679233 0.555396
H  -2.528505 4.350675 1.057016
H  -0.446032 2.825241 1.310451
H  0.643952 2.614659 -0.057244
H  0.590788 4.149154 0.803906
H  -1.998506 -2.397626 -0.477519
H  -0.47042 -0.466935 1.336301
H  -0.047894 -3.655343 -0.689222
H  1.424573 -3.125833 -1.49768
H  -0.128591 -2.414052 -1.922029
H  1.733602 -0.421354 1.138492
H  5.882326 0.01661 0.593371
H  5.580299 -1.007182 -0.805626
H  5.587976 -3.038664 0.70297
H  7.086081 -2.123601 0.826392
H  5.872196 -1.983064 2.094623
elementType: O C H
totalener: -816.42701065 hartree
nucrepener: 1447.97194676 hartree
electener: -2264.39895741 hartree
oneelecener: -3981.34096460 hartree
twoeener: 1716.94200719 hartree
cpcmener: -0.01634709 hartree
kineticenergy: 812.45029240 hartree
xcener: -82.315599878003 hartree
chargesum: 0.0000000
charge: -0.293106 -0.487172 0.087681 -0.159870 -0.186845 -0.151806 0.082984 -0.147831 -0.333349 -0.316323 -0.320178 -0.111310 -0.171521 0.030450 -0.266284 -0.187391 0.473176 0.038495 -0.255378 0.055701 0.086806 0.076989 0.061809 0.090516 0.074261 0.076519 0.036809 0.098361 0.080659 0.095129 0.082992 0.094243 0.091570 0.094333 0.079094 0.078722 0.091952 0.097030 0.127538 0.111641 0.104694 0.107990 0.105628 0.112925 0.106487 0.086006 0.088609 0.093427 0.087140
qa: -0.2931 -0.4872 0.0877 -0.1599 -0.1868 -0.1518 0.0830 -0.1478 -0.3333 -0.3163 -0.3202 -0.1113 -0.1715 0.0304 -0.2663 -0.1874 0.4732 0.0385 -0.2554 0.0557 0.0868 0.0770 0.0618 0.0905 0.0743 0.0765 0.0368 0.0984 0.0807 0.0951 0.0830 0.0942 0.0916 0.0943 0.0791 0.0787 0.0920 0.0970 0.1275 0.1116 0.1047 0.1080 0.1056 0.1129 0.1065 0.0860 0.0886 0.0934 0.0871
va: 2.1172 2.0128 3.7863 3.8842 3.8761 3.8726 3.8171 3.9271 3.9535 3.9438 3.9457 3.8447 3.9098 3.6698 3.9182 3.7667 4.1733 3.8535 3.9152 1.0132 1.0084 1.0089 0.9973 0.9978 1.0117 1.0100 1.0111 1.0068 1.0046 1.0040 0.9969 1.0029 1.0027 1.0047 0.9975 0.9974 1.0030 1.0059 1.0010 1.0208 0.9963 1.0369 0.9962 1.0342 0.9956 1.0126 1.0140 1.0073 1.0043
dispcorr: -0.021165245 hartree
energy: -816.448175890830
dipole: -18.03535 17.17183 -0.86352 15.13104 -14.66936 0.46169 1.51017 -1.02420 0.48597
magnitude: 1.09315 au
magnitude: 2.77857 debye
