program: Orca
programVersion: 5.0.2
elementType: O O C C C C C C C C C C C C C C C C C H H H H H H H H H H H H H H H H H H H H H H H H H H H H H H
charge: 0
multiplicity: 1
keywords: wb97x-d3
keywords: def2-TZVPP
keywords: def2/J RIJCOSX
keywords: DEFGRID2
keywords: scfconv7
keywords: smallprint printgap noloewdin
keywords: NOSOSCF
formula: C17H30O2
InChI: InChI=1/C17H30O2/c1-6-19-17(18)13-16(5)12-8-11-15(4)10-7-9-14(2)3/h8,12-15H,6-7,9-11H2,1-5H3
49 atoms
O  3.952978 -0.650689 0.515513
O  3.427247 -2.263975 -0.939312
C  -4.044725 -0.421773 -0.140084
C  -3.301771 0.608347 -0.996395
C  -2.638251 1.751179 -0.233649
C  -1.786369 2.622785 -1.151249
C  -0.965901 3.716214 -0.459088
C  -3.126956 -1.109635 0.886703
C  -5.258945 0.172723 0.562353
C  -1.842908 4.721405 0.2790
C  0.100476 3.139048 0.467754
C  -1.8914 -1.667865 0.268771
C  -0.653343 -1.272225 0.583819
C  0.576356 -1.74865 -0.043174
C  0.44878 -2.800922 -1.097475
C  1.728162 -1.176342 0.370136
C  3.085957 -1.450929 -0.108016
C  5.348229 -0.779743 0.215978
C  5.993556 -1.921413 0.968793
H  -4.404464 -1.199019 -0.824487
H  -4.00326 1.023138 -1.728405
H  -2.537329 0.090475 -1.585734
H  -2.012248 1.345411 0.565404
H  -3.400785 2.361194 0.258906
H  -1.097907 1.976713 -1.707625
H  -2.433569 3.087719 -1.903326
H  -0.4435 4.260099 -1.254499
H  -3.693379 -1.92124 1.35659
H  -2.863139 -0.412253 1.686243
H  -5.936612 0.646576 -0.15079
H  -5.82641 -0.596056 1.09097
H  -4.972796 0.927815 1.297184
H  -2.61244 5.139109 -0.374228
H  -1.250132 5.555891 0.659561
H  -2.34796 4.269568 1.135532
H  0.727651 2.407864 -0.047978
H  0.758535 3.924026 0.846263
H  -0.336068 2.641832 1.336581
H  -2.043293 -2.417814 -0.502916
H  -0.532414 -0.516404 1.355288
H  1.401717 -3.133229 -1.489696
H  -0.148207 -2.424883 -1.931075
H  -0.079406 -3.670171 -0.70169
H  1.663481 -0.41544 1.140107
H  5.782971 0.170401 0.524384
H  5.500313 -0.877791 -0.860305
H  5.858718 -1.81362 2.045555
H  5.602435 -2.892199 0.66599
H  7.065779 -1.919845 0.767612
elementType: O C H
totalener: -816.42670987 hartree
nucrepener: 1455.03903492 hartree
electener: -2271.46574480 hartree
oneelecener: -3995.48185176 hartree
twoeener: 1724.01610696 hartree
cpcmener: -0.01636691 hartree
kineticenergy: 812.44989415 hartree
xcener: -82.315552657397 hartree
chargesum: -0.0000000
charge: -0.293349 -0.487068 0.084521 -0.157485 -0.190337 -0.152367 0.082677 -0.145113 -0.332679 -0.315853 -0.320945 -0.109979 -0.175369 0.035913 -0.266835 -0.191509 0.473598 0.038471 -0.255446 0.055356 0.087695 0.076510 0.063039 0.090820 0.073759 0.078271 0.036991 0.098265 0.079929 0.094011 0.094882 0.083191 0.091748 0.094252 0.079456 0.091238 0.097796 0.078393 0.127733 0.112344 0.108083 0.106140 0.104584 0.113012 0.106458 0.085896 0.087084 0.088606 0.093608
qa: -0.2933 -0.4871 0.0845 -0.1575 -0.1903 -0.1524 0.0827 -0.1451 -0.3327 -0.3159 -0.3209 -0.1100 -0.1754 0.0359 -0.2668 -0.1915 0.4736 0.0385 -0.2554 0.0554 0.0877 0.0765 0.0630 0.0908 0.0738 0.0783 0.0370 0.0983 0.0799 0.0940 0.0949 0.0832 0.0917 0.0943 0.0795 0.0912 0.0978 0.0784 0.1277 0.1123 0.1081 0.1061 0.1046 0.1130 0.1065 0.0859 0.0871 0.0886 0.0936
va: 2.1157 2.0131 3.7928 3.8813 3.8754 3.8705 3.8162 3.9266 3.9536 3.9439 3.9472 3.8425 3.9127 3.6560 3.9188 3.7656 4.1741 3.8544 3.9149 1.0132 1.0081 1.0091 0.9974 0.9987 1.0118 1.0097 1.0111 1.0072 1.0049 1.0030 1.0039 0.9970 1.0026 1.0047 0.9974 1.0025 1.0064 0.9976 1.0009 1.0200 1.0366 0.9959 0.9966 1.0340 0.9956 1.0124 1.0043 1.0141 1.0073
dispcorr: -0.021490576 hartree
energy: -816.448200448746
dipole: -17.40397 16.53346 -0.87051 14.84993 -14.37147 0.47846 1.62374 -1.16207 0.46167
magnitude: 1.09537 au
magnitude: 2.78422 debye
