program: Orca
programVersion: 5.0.2
elementType: O O C C C C C C C C C C C C C C C C C H H H H H H H H H H H H H H H H H H H H H H H H H H H H H H
charge: 0
multiplicity: 1
keywords: wb97x-d3
keywords: def2-TZVPP
keywords: def2/J RIJCOSX
keywords: DEFGRID2
keywords: scfconv7
keywords: smallprint printgap noloewdin
keywords: NOSOSCF
formula: C17H30O2
InChI: InChI=1/C17H30O2/c1-6-19-17(18)13-16(5)12-8-11-15(4)10-7-9-14(2)3/h8,12-15H,6-7,9-11H2,1-5H3
49 atoms
O  3.615141 -0.695453 1.17506
O  3.30647 -1.176639 -0.985963
C  -4.205633 -0.345999 0.141206
C  -3.468179 0.936568 0.550725
C  -2.516499 1.503037 -0.501057
C  -1.587627 2.563467 0.0775
C  -0.64088 3.221526 -0.927617
C  -3.401437 -1.610179 0.504596
C  -5.578788 -0.421278 0.799527
C  0.124585 4.361018 -0.263715
C  0.330958 2.220553 -1.544032
C  -2.072808 -1.692011 -0.163149
C  -0.89755 -1.575935 0.464869
C  0.404358 -1.549218 -0.197046
C  0.439157 -1.838536 -1.664018
C  1.469793 -1.222606 0.567222
C  2.858976 -1.047687 0.1333
C  5.015847 -0.476764 0.968491
C  5.804248 -1.766454 0.987831
H  -4.352481 -0.334686 -0.945716
H  -2.917587 0.74625 1.480022
H  -4.200108 1.711395 0.801043
H  -3.10242 1.931726 -1.321461
H  -1.926367 0.698456 -0.942908
H  -2.193643 3.342051 0.555282
H  -0.99049 2.113507 0.880665
H  -1.248166 3.647967 -1.735507
H  -3.992609 -2.486623 0.21749
H  -3.279852 -1.650118 1.591518
H  -5.49527 -0.405205 1.889211
H  -6.203713 0.424231 0.506661
H  -6.109922 -1.334681 0.523865
H  -0.551262 5.111801 0.151345
H  0.78396 4.868385 -0.97089
H  0.746695 3.991429 0.555877
H  0.929627 1.726936 -0.772995
H  -0.178905 1.44355 -2.115498
H  1.023924 2.715715 -2.227602
H  -2.096916 -1.818926 -1.241706
H  -0.892036 -1.432536 1.542011
H  -0.065052 -1.042815 -2.217593
H  -0.100078 -2.761738 -1.880943
H  1.443603 -1.932896 -2.057044
H  1.29535 -1.038533 1.621329
H  5.318055 0.1648 1.795564
H  5.183709 0.075939 0.042664
H  5.644546 -2.314763 1.916919
H  5.552247 -2.418846 0.152275
H  6.868157 -1.535142 0.91845
elementType: O C H
totalener: -816.42608688 hartree
nucrepener: 1479.14122946 hartree
electener: -2295.56731635 hartree
oneelecener: -4043.80897756 hartree
twoeener: 1748.24166121 hartree
cpcmener: -0.01666766 hartree
kineticenergy: 812.44143066 hartree
xcener: -82.311033777558 hartree
chargesum: 0.0000000
charge: -0.293881 -0.489256 0.079950 -0.187881 -0.119934 -0.171662 0.094417 -0.131598 -0.308946 -0.296028 -0.318001 -0.085354 -0.182803 0.008211 -0.265255 -0.192856 0.486786 0.038933 -0.255652 0.046440 0.068226 0.081752 0.076557 0.054071 0.075709 0.062953 0.026417 0.090210 0.079976 0.087508 0.088955 0.088913 0.087061 0.089684 0.081036 0.075106 0.090820 0.098631 0.129337 0.112865 0.102502 0.110189 0.112138 0.112021 0.106490 0.086309 0.086657 0.088577 0.093699
qa: -0.2939 -0.4893 0.0800 -0.1879 -0.1199 -0.1717 0.0944 -0.1316 -0.3089 -0.2960 -0.3180 -0.0854 -0.1828 0.0082 -0.2653 -0.1929 0.4868 0.0389 -0.2557 0.0464 0.0682 0.0818 0.0766 0.0541 0.0757 0.0630 0.0264 0.0902 0.0800 0.0875 0.0890 0.0889 0.0871 0.0897 0.0810 0.0751 0.0908 0.0986 0.1293 0.1129 0.1025 0.1102 0.1121 0.1120 0.1065 0.0863 0.0867 0.0886 0.0937
va: 2.1162 2.0060 3.7456 3.8996 3.8470 3.8834 3.8040 3.9413 3.9443 3.9325 3.9461 3.8370 3.8990 3.6637 3.9103 3.7639 4.1482 3.8534 3.9166 1.0209 1.0094 1.0066 1.0148 1.0164 1.0111 1.0124 1.0184 1.0078 1.0127 0.9998 1.0039 1.0047 1.0052 1.0054 1.0024 1.0019 0.9973 1.0075 0.9994 1.0230 0.9956 0.9989 1.0346 1.0346 0.9952 1.0128 1.0044 1.0134 1.0073
dispcorr: -0.022468640 hartree
energy: -816.448555522741
dipole: -14.10939 13.11308 -0.99631 11.69072 -11.59000 0.10072 -1.30491 1.83274 0.52783
magnitude: 1.13198 au
magnitude: 2.87726 debye
