program: Orca
programVersion: 5.0.2
elementType: O O C C C C C C C C C C C C C C C C C H H H H H H H H H H H H H H H H H H H H H H H H H H H H H H
charge: 0
multiplicity: 1
keywords: wb97x-d3
keywords: def2-TZVPP
keywords: def2/J RIJCOSX
keywords: DEFGRID2
keywords: scfconv7
keywords: smallprint printgap noloewdin
keywords: NOSOSCF
formula: C17H30O2
InChI: InChI=1/C17H30O2/c1-6-19-17(18)13-16(5)12-8-11-15(4)10-7-9-14(2)3/h8,12-15H,6-7,9-11H2,1-5H3
49 atoms
O  5.200863 -2.772569 -0.381812
O  4.450792 -2.941017 1.717126
C  -1.976768 1.065844 -0.13924
C  -3.190682 1.508752 -0.957651
C  -3.900339 2.751805 -0.430181
C  -5.166322 3.063738 -1.221679
C  -5.960274 4.29176 -0.760787
C  -1.467902 -0.288357 -0.658131
C  -0.862754 2.105409 -0.148644
C  -6.487426 4.141571 0.662666
C  -5.168787 5.586589 -0.912313
C  -0.397629 -0.877276 0.194543
C  0.825559 -1.203014 -0.236266
C  1.886374 -1.777825 0.588333
C  1.586194 -2.005989 2.035556
C  3.054117 -2.055946 -0.031002
C  4.26626 -2.630874 0.560113
C  6.470674 -3.326965 -0.016719
C  6.445108 -4.837945 0.027536
H  -2.305638 0.921868 0.897944
H  -3.910337 0.682779 -0.986596
H  -2.881786 1.676454 -1.996536
H  -3.223251 3.609479 -0.464241
H  -4.146429 2.597246 0.625467
H  -4.899114 3.196444 -2.276159
H  -5.826955 2.190036 -1.18908
H  -6.83001 4.363116 -1.423929
H  -1.117369 -0.182756 -1.689697
H  -2.313181 -0.986107 -0.681881
H  -1.188309 3.056803 0.273424
H  0.000092 1.777593 0.433858
H  -0.515092 2.296853 -1.167645
H  -5.680587 4.132323 1.398635
H  -7.055137 3.216383 0.78556
H  -7.150868 4.968215 0.925141
H  -4.313968 5.625462 -0.233619
H  -4.787597 5.707713 -1.928744
H  -5.792044 6.455943 -0.692774
H  -0.665432 -1.03558 1.235882
H  1.071236 -1.032814 -1.281155
H  0.732449 -2.678107 2.141225
H  1.305041 -1.06572 2.513793
H  2.418384 -2.427825 2.584687
H  3.125463 -1.839526 -1.09109
H  6.811678 -2.908498 0.931827
H  7.15309 -2.982185 -0.792932
H  7.453393 -5.205232 0.224178
H  5.795515 -5.219271 0.814826
H  6.12007 -5.258043 -0.924897
elementType: O C H
totalener: -816.42859229 hartree
nucrepener: 1346.42296737 hartree
electener: -2162.85155966 hartree
oneelecener: -3778.15718359 hartree
twoeener: 1615.30562393 hartree
cpcmener: -0.01640283 hartree
kineticenergy: 812.44146137 hartree
xcener: -82.311135290689 hartree
chargesum: -0.0000000
charge: -0.292331 -0.487403 0.111695 -0.183537 -0.142377 -0.153781 0.070613 -0.105885 -0.338442 -0.314477 -0.315994 -0.159339 -0.135874 0.012012 -0.264372 -0.177978 0.471959 0.039188 -0.254848 0.041512 0.070591 0.070241 0.074770 0.069376 0.073667 0.074157 0.037991 0.078578 0.093577 0.096683 0.097821 0.084775 0.080086 0.091977 0.093630 0.078687 0.092209 0.094252 0.124219 0.110646 0.104480 0.104421 0.108698 0.113798 0.085472 0.106020 0.093634 0.088321 0.086882
qa: -0.2923 -0.4874 0.1117 -0.1835 -0.1424 -0.1538 0.0706 -0.1059 -0.3384 -0.3145 -0.3160 -0.1593 -0.1359 0.0120 -0.2644 -0.1780 0.4720 0.0392 -0.2548 0.0415 0.0706 0.0702 0.0748 0.0694 0.0737 0.0742 0.0380 0.0786 0.0936 0.0967 0.0978 0.0848 0.0801 0.0920 0.0936 0.0787 0.0922 0.0943 0.1242 0.1106 0.1045 0.1044 0.1087 0.1138 0.0855 0.1060 0.0936 0.0883 0.0869
va: 2.1175 2.0128 3.7459 3.9140 3.8737 3.8898 3.8272 3.9197 3.9518 3.9407 3.9427 3.8938 3.9211 3.7044 3.9198 3.7697 4.1735 3.8543 3.9153 1.0230 1.0126 1.0106 1.0002 1.0049 1.0096 1.0100 1.0107 1.0166 1.0059 1.0022 1.0028 1.0027 0.9982 1.0028 1.0043 0.9986 1.0027 1.0045 1.0045 1.0240 0.9960 0.9960 1.0369 1.0334 1.0128 0.9954 1.0073 1.0140 1.0044
dispcorr: -0.018769821 hartree
energy: -816.447362113023
dipole: -30.55196 29.72217 -0.82979 22.25147 -21.85071 0.40077 -2.92897 2.18444 -0.74453
magnitude: 1.18469 au
magnitude: 3.01124 debye
