program: Orca
programVersion: 5.0.2
elementType: O O C C C C C C C C C C C C C C C C C H H H H H H H H H H H H H H H H H H H H H H H H H H H H H H
charge: 0
multiplicity: 1
keywords: wb97x-d3
keywords: def2-TZVPP
keywords: def2/J RIJCOSX
keywords: DEFGRID2
keywords: scfconv7
keywords: smallprint printgap noloewdin
keywords: NOSOSCF
formula: C17H30O2
InChI: InChI=1/C17H30O2/c1-6-19-17(18)13-16(5)12-8-11-15(4)10-7-9-14(2)3/h8,12-15H,6-7,9-11H2,1-5H3
49 atoms
O  4.451442 -2.066485 -0.414482
O  3.752628 -2.341085 1.690856
C  -3.390241 -0.156124 -0.433783
C  -2.50593 1.070034 -0.661922
C  -3.23152 2.406639 -0.552859
C  -2.328402 3.582575 -0.906944
C  -3.010553 4.952248 -0.907307
C  -2.63267 -1.453392 -0.77528
C  -3.976382 -0.197556 0.973839
C  -3.529907 5.341692 0.472262
C  -2.053351 6.01792 -1.429951
C  -1.455702 -1.711451 0.103111
C  -0.188798 -1.736772 -0.324499
C  0.981783 -1.963722 0.519984
C  0.745337 -2.181062 1.980597
C  2.186073 -1.949877 -0.091881
C  3.50318 -2.143538 0.521457
C  5.817895 -2.259752 -0.028075
C  6.180422 -3.723747 0.078797
H  -4.225977 -0.100722 -1.141186
H  -2.053363 0.994805 -1.657427
H  -1.671313 1.055345 0.04832
H  -3.622856 2.531608 0.460054
H  -4.102147 2.404222 -1.21918
H  -1.477855 3.609178 -0.214424
H  -1.899712 3.406527 -1.899967
H  -3.866556 4.901672 -1.591549
H  -2.314683 -1.419319 -1.820842
H  -3.331401 -2.292466 -0.684406
H  -4.529608 -1.123682 1.145063
H  -3.201648 -0.129804 1.741108
H  -4.671462 0.625287 1.144231
H  -3.987245 6.333143 0.455416
H  -2.716838 5.368597 1.203034
H  -4.284234 4.647578 0.845853
H  -2.53029 6.999129 -1.475081
H  -1.176486 6.109872 -0.783514
H  -1.696573 5.780634 -2.434407
H  -1.670192 -1.881366 1.153763
H  0.007896 -1.570718 -1.38033
H  0.100198 -3.048474 2.133119
H  0.222437 -1.323275 2.40812
H  1.657091 -2.335487 2.543781
H  2.204696 -1.780071 -1.162605
H  6.030377 -1.730084 0.902125
H  6.396382 -1.78283 -0.818553
H  7.246736 -3.812589 0.291475
H  5.641062 -4.226801 0.880782
H  5.98443 -4.250959 -0.855501
elementType: O C H
totalener: -816.42871464 hartree
nucrepener: 1381.06380198 hartree
electener: -2197.49251662 hartree
oneelecener: -3847.51289694 hartree
twoeener: 1650.02038033 hartree
cpcmener: -0.01641694 hartree
kineticenergy: 812.44311258 hartree
xcener: -82.311328863079 hartree
chargesum: -0.0000000
charge: -0.292671 -0.487293 0.125170 -0.191848 -0.121335 -0.157562 0.074937 -0.137452 -0.339101 -0.303987 -0.297231 -0.138346 -0.150230 0.018756 -0.265805 -0.177075 0.470253 0.037438 -0.254512 0.042371 0.072075 0.069487 0.071221 0.060852 0.065750 0.068062 0.025662 0.084882 0.099386 0.098301 0.083920 0.095973 0.090672 0.082711 0.087892 0.089436 0.080565 0.087226 0.127281 0.110721 0.104944 0.104111 0.109244 0.113757 0.086362 0.106402 0.093529 0.088156 0.086942
qa: -0.2927 -0.4873 0.1252 -0.1918 -0.1213 -0.1576 0.0749 -0.1375 -0.3391 -0.3040 -0.2972 -0.1383 -0.1502 0.0188 -0.2658 -0.1771 0.4703 0.0374 -0.2545 0.0424 0.0721 0.0695 0.0712 0.0609 0.0657 0.0681 0.0257 0.0849 0.0994 0.0983 0.0839 0.0960 0.0907 0.0827 0.0879 0.0894 0.0806 0.0872 0.1273 0.1107 0.1049 0.1041 0.1092 0.1138 0.0864 0.1064 0.0935 0.0882 0.0869
va: 2.1173 2.0128 3.7360 3.9333 3.8837 3.8881 3.8166 3.9225 3.9620 3.9298 3.9326 3.8603 3.9139 3.6961 3.9185 3.7719 4.1723 3.8540 3.9160 1.0183 1.0129 1.0067 1.0034 1.0110 1.0112 1.0124 1.0181 1.0138 1.0049 1.0031 0.9963 1.0010 1.0045 1.0026 1.0029 1.0050 1.0032 1.0050 0.9941 1.0237 0.9960 0.9961 1.0370 1.0333 1.0126 0.9954 1.0074 1.0139 1.0043
dispcorr: -0.019051793 hartree
energy: -816.447766431970
dipole: -22.04359 21.14919 -0.89440 20.70643 -20.55121 0.15522 -1.76554 0.96058 -0.80496
magnitude: 1.21326 au
magnitude: 3.08386 debye
