program: Orca
programVersion: 5.0.2
elementType: O O C C C C C C C C C C C C C C C C C H H H H H H H H H H H H H H H H H H H H H H H H H H H H H H
charge: 0
multiplicity: 1
keywords: wb97x-d3
keywords: def2-TZVPP
keywords: def2/J RIJCOSX
keywords: DEFGRID2
keywords: scfconv7
keywords: smallprint printgap noloewdin
keywords: NOSOSCF
formula: C17H30O2
InChI: InChI=1/C17H30O2/c1-6-19-17(18)13-16(5)12-8-11-15(4)10-7-9-14(2)3/h8,12-15H,6-7,9-11H2,1-5H3
49 atoms
O  3.752395 -1.408788 1.213101
O  3.381685 -1.740934 -0.966133
C  -4.188869 -0.301065 0.085144
C  -3.56375 1.061079 0.412518
C  -2.44928 1.523407 -0.520549
C  -1.861599 2.867839 -0.107722
C  -0.638637 3.307587 -0.917017
C  -3.339772 -1.487422 0.578193
C  -5.584922 -0.399566 0.692266
C  -0.287967 4.757471 -0.602084
C  0.568057 2.408477 -0.664533
C  -2.026742 -1.638791 -0.107637
C  -0.837307 -1.637698 0.503885
C  0.452505 -1.718283 -0.175813
C  0.438657 -1.883183 -1.662202
C  1.556151 -1.601121 0.594899
C  2.955033 -1.597472 0.15937
C  5.166705 -1.326115 0.999207
C  5.595055 0.049135 0.539377
H  -4.288651 -0.385667 -1.004172
H  -3.193092 1.040625 1.444559
H  -4.354365 1.819487 0.399387
H  -2.838689 1.595193 -1.542037
H  -1.658065 0.774579 -0.550558
H  -2.639947 3.63502 -0.187315
H  -1.583313 2.832859 0.953044
H  -0.894198 3.245007 -1.982034
H  -3.915966 -2.403903 0.40341
H  -3.197918 -1.408812 1.660559
H  -5.550992 -0.295048 1.779761
H  -6.239088 0.385092 0.308211
H  -6.055543 -1.359079 0.468805
H  -1.117829 5.430119 -0.828546
H  0.575841 5.09681 -1.177533
H  -0.044727 4.881807 0.456609
H  1.432231 2.733386 -1.247653
H  0.857705 2.430125 0.38961
H  0.378584 1.366863 -0.929852
H  -2.076307 -1.741028 -1.188268
H  -0.804743 -1.521424 1.58371
H  -0.13141 -2.771938 -1.938953
H  1.428029 -1.969285 -2.093244
H  -0.061901 -1.032743 -2.130473
H  1.412752 -1.473959 1.662037
H  5.493788 -2.097743 0.300057
H  5.604152 -1.554264 1.970564
H  5.21294 0.293549 -0.451264
H  5.267631 0.820489 1.237287
H  6.684307 0.085999 0.491882
elementType: O C H
totalener: -816.42641258 hartree
nucrepener: 1462.51892617 hartree
electener: -2278.94533875 hartree
oneelecener: -4010.48906743 hartree
twoeener: 1731.54372868 hartree
cpcmener: -0.01653428 hartree
kineticenergy: 812.44621422 hartree
xcener: -82.312215261305 hartree
chargesum: -0.0000000
charge: -0.292735 -0.487796 0.086088 -0.190908 -0.056512 -0.169586 0.079242 -0.119760 -0.302772 -0.294496 -0.280091 -0.116841 -0.151719 -0.010132 -0.260885 -0.178861 0.480051 0.038318 -0.255818 0.039135 0.067041 0.075217 0.066270 0.006221 0.071336 0.063525 0.023981 0.093208 0.079866 0.086185 0.088829 0.089227 0.086417 0.089098 0.080736 0.093810 0.082748 0.064648 0.129837 0.109436 0.110942 0.112320 0.101504 0.111846 0.085987 0.106447 0.088763 0.086981 0.093653
qa: -0.2927 -0.4878 0.0861 -0.1909 -0.0565 -0.1696 0.0792 -0.1198 -0.3028 -0.2945 -0.2801 -0.1168 -0.1517 -0.0101 -0.2609 -0.1789 0.4801 0.0383 -0.2558 0.0391 0.0670 0.0752 0.0663 0.0062 0.0713 0.0635 0.0240 0.0932 0.0799 0.0862 0.0888 0.0892 0.0864 0.0891 0.0807 0.0938 0.0827 0.0646 0.1298 0.1094 0.1109 0.1123 0.1015 0.1118 0.0860 0.1064 0.0888 0.0870 0.0937
va: 2.1169 2.0116 3.7575 3.9281 3.8327 3.9110 3.8277 3.9222 3.9340 3.9270 3.9340 3.8728 3.8977 3.6862 3.9068 3.7534 4.1650 3.8544 3.9155 1.0225 1.0091 1.0068 1.0169 1.0489 1.0112 1.0114 1.0173 1.0052 1.0148 1.0003 1.0048 1.0049 1.0054 1.0053 1.0029 1.0063 1.0045 1.0048 1.0025 1.0239 0.9976 1.0371 0.9928 1.0345 1.0125 0.9954 1.0139 1.0045 1.0073
dispcorr: -0.021530419 hartree
energy: -816.447942999124
dipole: -15.29775 14.30544 -0.99231 17.59841 -17.34554 0.25288 -1.61839 2.12571 0.50732
magnitude: 1.14280 au
magnitude: 2.90478 debye
