program: Orca
programVersion: 5.0.2
elementType: O O C C C C C C C C C C C C C C C C C H H H H H H H H H H H H H H H H H H H H H H H H H H H H H H
charge: 0
multiplicity: 1
keywords: wb97x-d3
keywords: def2-TZVPP
keywords: def2/J RIJCOSX
keywords: DEFGRID2
keywords: scfconv7
keywords: smallprint printgap noloewdin
keywords: NOSOSCF
formula: C17H30O2
InChI: InChI=1/C17H30O2/c1-6-19-17(18)13-16(5)12-8-11-15(4)10-7-9-14(2)3/h8,12-15H,6-7,9-11H2,1-5H3
49 atoms
O  3.915673 -0.939253 0.673877
O  3.348119 -2.50368 -0.811074
C  -4.096113 -0.480293 -0.095216
C  -3.346123 0.548547 -0.947037
C  -2.700134 1.69939 -0.182268
C  -1.880643 2.604272 -1.09524
C  -1.196398 3.780897 -0.396382
C  -3.190673 -1.160002 0.947102
C  -5.321743 0.114537 0.587204
C  -0.14358 3.319616 0.606476
C  -0.572944 4.718875 -1.424149
C  -1.96074 -1.747172 0.34548
C  -0.716543 -1.373725 0.663366
C  0.505001 -1.895463 0.056518
C  0.357005 -2.956873 -0.98617
C  1.670332 -1.360157 0.480775
C  3.023618 -1.687476 0.024269
C  5.302004 -1.120703 0.358597
C  6.100998 -0.194269 1.240263
H  -4.444463 -1.262333 -0.780075
H  -4.040386 0.95524 -1.690254
H  -2.570045 0.033005 -1.523104
H  -2.058739 1.300215 0.607622
H  -3.466627 2.296475 0.322362
H  -1.116982 2.005436 -1.606819
H  -2.534728 2.992859 -1.883992
H  -1.96418 4.342148 0.150536
H  -3.768761 -1.956846 1.428134
H  -2.922223 -0.452395 1.736024
H  -5.048082 0.868864 1.327481
H  -5.98713 0.589144 -0.136887
H  -5.898208 -0.654543 1.105399
H  -0.568924 2.718387 1.411493
H  0.357155 4.170208 1.073527
H  0.625563 2.715019 0.11748
H  0.200101 4.208672 -2.0049
H  -1.317524 5.09518 -2.128716
H  -0.106369 5.583539 -0.947701
H  -2.122207 -2.506305 -0.415246
H  -0.582607 -0.607504 1.42252
H  -0.232711 -2.579678 -1.824231
H  -0.187443 -3.811381 -0.58029
H  1.303419 -3.312376 -1.373972
H  1.622565 -0.591045 1.243787
H  5.474403 -0.89618 -0.696734
H  5.589882 -2.160607 0.529894
H  5.844528 0.851472 1.067355
H  5.955642 -0.417951 2.297661
H  7.161304 -0.316663 1.018228
elementType: O C H
totalener: -816.42958403 hartree
nucrepener: 1440.14354554 hartree
electener: -2256.57312958 hartree
oneelecener: -3965.60893119 hartree
twoeener: 1709.03580161 hartree
cpcmener: -0.01695100 hartree
kineticenergy: 812.44775152 hartree
xcener: -82.312861000843 hartree
chargesum: 0.0000000
charge: -0.286369 -0.485995 0.081884 -0.158968 -0.152677 -0.158326 0.081861 -0.147660 -0.331371 -0.308200 -0.295835 -0.112443 -0.167892 0.028024 -0.265678 -0.174854 0.461641 0.040888 -0.252455 0.055046 0.086719 0.077153 0.055928 0.078290 0.066107 0.070326 0.023824 0.098591 0.080551 0.083804 0.093982 0.094780 0.089796 0.092949 0.082415 0.081208 0.087070 0.088301 0.127228 0.111637 0.105444 0.104811 0.107839 0.112694 0.093966 0.092202 0.087595 0.087083 0.087088
qa: -0.2864 -0.4860 0.0819 -0.1590 -0.1527 -0.1583 0.0819 -0.1477 -0.3314 -0.3082 -0.2958 -0.1124 -0.1679 0.0280 -0.2657 -0.1749 0.4616 0.0409 -0.2525 0.0550 0.0867 0.0772 0.0559 0.0783 0.0661 0.0703 0.0238 0.0986 0.0806 0.0838 0.0940 0.0948 0.0898 0.0929 0.0824 0.0812 0.0871 0.0883 0.1272 0.1116 0.1054 0.1048 0.1078 0.1127 0.0940 0.0922 0.0876 0.0871 0.0871
va: 2.1182 2.0199 3.7953 3.8859 3.8701 3.8791 3.8108 3.9258 3.9517 3.9285 3.9303 3.8467 3.9094 3.6760 3.9183 3.7732 4.1693 3.8498 3.9696 1.0132 1.0085 1.0080 1.0059 1.0099 1.0132 1.0121 1.0185 1.0070 1.0049 0.9968 1.0032 1.0036 1.0011 1.0055 1.0031 1.0029 1.0049 1.0056 1.0012 1.0213 0.9961 0.9964 1.0370 1.0334 0.9960 0.9968 1.0032 1.0034 1.0069
dispcorr: -0.020379602 hartree
energy: -816.449963634478
dipole: -15.78283 14.84923 -0.93360 18.17139 -17.61145 0.55993 -0.61299 1.13885 0.52586
magnitude: 1.20899 au
magnitude: 3.07301 debye
