program: Orca
programVersion: 5.0.2
elementType: O O C C C C C C C C C C C C C C C C C H H H H H H H H H H H H H H H H H H H H H H H H H H H H H H
charge: 0
multiplicity: 1
keywords: wb97x-d3
keywords: def2-TZVPP
keywords: def2/J RIJCOSX
keywords: DEFGRID2
keywords: scfconv7
keywords: smallprint printgap noloewdin
keywords: NOSOSCF
formula: C17H30O2
InChI: InChI=1/C17H30O2/c1-6-19-17(18)13-16(5)12-8-11-15(4)10-7-9-14(2)3/h8,12-15H,6-7,9-11H2,1-5H3
49 atoms
O  3.89408 -0.906359 0.66869
O  3.335729 -2.473109 -0.817315
C  -4.109746 -0.47877 -0.093313
C  -3.352171 0.545674 -0.943619
C  -2.692349 1.687367 -0.176661
C  -1.851919 2.575179 -1.087396
C  -1.142215 3.734572 -0.385349
C  -3.208627 -1.168706 0.946397
C  -5.329502 0.124243 0.592203
C  -0.096524 3.247137 0.612668
C  -0.500091 4.661918 -1.411356
C  -1.977155 -1.752934 0.344864
C  -0.734463 -1.377432 0.666075
C  0.489489 -1.884943 0.052223
C  0.347324 -2.942273 -0.995347
C  1.65166 -1.344725 0.479131
C  3.006629 -1.660913 0.020079
C  5.28103 -1.076945 0.350535
C  6.074759 -0.142783 1.228749
H  -4.465417 -1.256112 -0.779724
H  -4.043963 0.96142 -1.68417
H  -2.58273 0.023946 -1.523011
H  -2.063201 1.279584 0.61851
H  -3.452151 2.298486 0.321277
H  -1.100758 1.959902 -1.59803
H  -2.495778 2.979099 -1.876877
H  -1.896372 4.31052 0.165221
H  -3.789664 -1.968218 1.41925
H  -2.941545 -0.467655 1.741626
H  -5.048359 0.876798 1.331553
H  -5.99355 0.603372 -0.130144
H  -5.909915 -0.640672 1.112254
H  -0.532608 2.651151 1.415826
H  0.422931 4.084956 1.08239
H  0.658685 2.628904 0.118952
H  0.26065 4.137355 -1.995602
H  -1.237702 5.056752 -2.113141
H  -0.013895 5.514623 -0.932951
H  -2.135914 -2.505839 -0.422528
H  -0.604161 -0.614679 1.429313
H  -0.192815 -3.801786 -0.594148
H  1.295709 -3.290707 -1.384601
H  -0.244138 -2.563557 -1.831495
H  1.599536 -0.581239 1.247429
H  5.449444 -0.8528 -0.705567
H  5.577258 -2.114315 0.52291
H  7.135518 -0.257218 1.004585
H  5.80962 0.900516 1.05412
H  5.933381 -0.365179 2.28693
elementType: O C H
totalener: -816.42946217 hartree
nucrepener: 1443.30019245 hartree
electener: -2259.72965462 hartree
oneelecener: -3971.92447978 hartree
twoeener: 1712.19482517 hartree
cpcmener: -0.01695728 hartree
kineticenergy: 812.44850484 hartree
xcener: -82.313047916963 hartree
chargesum: -0.0000000
charge: -0.286486 -0.486010 0.080234 -0.157908 -0.154503 -0.159003 0.082689 -0.146335 -0.331042 -0.308757 -0.295843 -0.112055 -0.170019 0.029557 -0.265733 -0.175137 0.462200 0.040759 -0.252433 0.054928 0.087208 0.076797 0.056251 0.078851 0.066122 0.071098 0.023817 0.098515 0.080158 0.083895 0.093852 0.094806 0.089759 0.093487 0.082039 0.081273 0.087090 0.088213 0.127498 0.111643 0.104867 0.107796 0.105476 0.112424 0.093815 0.092388 0.087097 0.087585 0.087080
qa: -0.2865 -0.4860 0.0802 -0.1579 -0.1545 -0.1590 0.0827 -0.1463 -0.3310 -0.3088 -0.2958 -0.1121 -0.1700 0.0296 -0.2657 -0.1751 0.4622 0.0408 -0.2524 0.0549 0.0872 0.0768 0.0563 0.0789 0.0661 0.0711 0.0238 0.0985 0.0802 0.0839 0.0939 0.0948 0.0898 0.0935 0.0820 0.0813 0.0871 0.0882 0.1275 0.1116 0.1049 0.1078 0.1055 0.1124 0.0938 0.0924 0.0871 0.0876 0.0871
va: 2.1180 2.0198 3.7987 3.8843 3.8700 3.8789 3.8101 3.9260 3.9518 3.9289 3.9299 3.8453 3.9088 3.6721 3.9184 3.7723 4.1689 3.8499 3.9697 1.0132 1.0084 1.0082 1.0061 1.0101 1.0132 1.0119 1.0185 1.0070 1.0050 0.9969 1.0032 1.0036 1.0011 1.0057 1.0030 1.0029 1.0049 1.0056 1.0011 1.0211 0.9965 1.0370 0.9961 1.0335 0.9961 0.9968 1.0069 1.0032 1.0034
dispcorr: -0.020514202 hartree
energy: -816.449976368233
dipole: -15.58692 14.65050 -0.93643 17.96984 -17.41045 0.55938 -0.58660 1.10929 0.52269
magnitude: 1.20955 au
magnitude: 3.07443 debye
