program: Orca
programVersion: 5.0.2
elementType: O O C C C C C C C C C C C C C C C C C H H H H H H H H H H H H H H H H H H H H H H H H H H H H H H
charge: 0
multiplicity: 1
keywords: wb97x-d3
keywords: def2-TZVPP
keywords: def2/J RIJCOSX
keywords: DEFGRID2
keywords: scfconv7
keywords: smallprint printgap noloewdin
keywords: NOSOSCF
formula: C17H30O2
InChI: InChI=1/C17H30O2/c1-6-19-17(18)13-16(5)12-8-11-15(4)10-7-9-14(2)3/h8,12-15H,6-7,9-11H2,1-5H3
49 atoms
O  4.819013 -2.845985 1.642006
O  4.05363 -3.784442 -0.236568
C  -2.238255 0.782718 -0.081723
C  -3.125393 2.021093 0.071591
C  -3.26211 2.866968 -1.189056
C  -4.060767 4.153193 -0.989336
C  -5.497628 3.985398 -0.489449
C  -0.757521 1.165384 -0.233862
C  -2.43028 -0.16344 1.097749
C  -6.156253 5.350882 -0.32641
C  -6.326042 3.099229 -1.411892
C  0.105636 0.002121 -0.581308
C  1.140254 -0.422252 0.15154
C  1.991697 -1.564704 -0.170991
C  1.673285 -2.333598 -1.413576
C  2.996924 -1.833865 0.690373
C  3.977427 -2.919831 0.609125
C  5.861847 -3.82251 1.753269
C  7.066858 -3.473563 0.909441
H  -2.546973 0.256638 -0.99427
H  -2.741047 2.639448 0.892279
H  -4.119017 1.689462 0.389043
H  -3.71509 2.262078 -1.980998
H  -2.272573 3.145761 -1.562446
H  -3.519403 4.797253 -0.287264
H  -4.085432 4.700362 -1.938966
H  -5.469767 3.512606 0.498829
H  -0.405508 1.639012 0.687965
H  -0.657234 1.910468 -1.030039
H  -3.474648 -0.466497 1.193003
H  -1.836213 -1.073175 0.995222
H  -2.139064 0.31419 2.037005
H  -7.171091 5.262065 0.066801
H  -6.220754 5.875821 -1.283285
H  -5.594493 5.988084 0.360079
H  -5.934318 2.082355 -1.47215
H  -7.35855 3.024515 -1.064384
H  -6.350948 3.502297 -2.428181
H  -0.156352 -0.515995 -1.499934
H  1.381916 0.111083 1.067133
H  0.653551 -2.720473 -1.365947
H  2.343001 -3.16688 -1.584752
H  1.718243 -1.67678 -2.284469
H  3.107722 -1.184756 1.551601
H  5.482091 -4.816083 1.509248
H  6.126631 -3.821325 2.810088
H  6.847195 -3.500676 -0.157486
H  7.454898 -2.485592 1.159413
H  7.858679 -4.198689 1.102588
elementType: O C H
totalener: -816.42858274 hartree
nucrepener: 1356.39025024 hartree
electener: -2172.81883297 hartree
oneelecener: -3798.01350573 hartree
twoeener: 1625.19467275 hartree
cpcmener: -0.01650871 hartree
kineticenergy: 812.44886399 hartree
xcener: -82.312887146294 hartree
chargesum: -0.0000000
charge: -0.292957 -0.487618 0.094020 -0.185160 -0.124272 -0.196285 0.071728 -0.118987 -0.315667 -0.297418 -0.304439 -0.151193 -0.141212 0.014666 -0.265550 -0.176782 0.471323 0.038806 -0.255586 0.042742 0.073675 0.073584 0.068860 0.081905 0.074127 0.076865 0.033398 0.078437 0.100416 0.092064 0.094218 0.083472 0.088725 0.081020 0.088232 0.086565 0.091398 0.085156 0.124031 0.111368 0.104635 0.108751 0.104599 0.113275 0.085751 0.105970 0.088520 0.087288 0.093537
qa: -0.2930 -0.4876 0.0940 -0.1852 -0.1243 -0.1963 0.0717 -0.1190 -0.3157 -0.2974 -0.3044 -0.1512 -0.1412 0.0147 -0.2656 -0.1768 0.4713 0.0388 -0.2556 0.0427 0.0737 0.0736 0.0689 0.0819 0.0741 0.0769 0.0334 0.0784 0.1004 0.0921 0.0942 0.0835 0.0887 0.0810 0.0882 0.0866 0.0914 0.0852 0.1240 0.1114 0.1046 0.1088 0.1046 0.1133 0.0858 0.1060 0.0885 0.0873 0.0935
va: 2.1170 2.0124 3.7708 3.8959 3.8680 3.9088 3.7870 3.9147 3.9434 3.9299 3.9345 3.8805 3.9251 3.7035 3.9204 3.7698 4.1733 3.8538 3.9156 1.0227 1.0102 1.0085 1.0044 1.0161 1.0086 1.0105 1.0150 1.0183 1.0073 1.0056 1.0023 1.0030 1.0049 1.0040 1.0044 1.0011 1.0056 1.0026 1.0050 1.0243 0.9960 1.0368 0.9959 1.0334 1.0131 0.9955 1.0137 1.0043 1.0073
dispcorr: -0.019074826 hartree
energy: -816.447657561725
dipole: -30.66898 30.08711 -0.58186 21.56275 -20.64868 0.91407 -4.15621 4.47807 0.32186
magnitude: 1.13035 au
magnitude: 2.87311 debye
