program: Orca
programVersion: 5.0.2
elementType: O O C C C C C C C C C C C C C C C C C H H H H H H H H H H H H H H H H H H H H H H H H H H H H H H
charge: 0
multiplicity: 1
keywords: wb97x-d3
keywords: def2-TZVPP
keywords: def2/J RIJCOSX
keywords: DEFGRID2
keywords: scfconv7
keywords: smallprint printgap noloewdin
keywords: NOSOSCF
formula: C17H30O2
InChI: InChI=1/C17H30O2/c1-6-19-17(18)13-16(5)12-8-11-15(4)10-7-9-14(2)3/h8,12-15H,6-7,9-11H2,1-5H3
49 atoms
O  4.297495 -2.103883 1.266561
O  3.853064 -2.537398 -0.875603
C  -3.488692 -0.188806 0.094411
C  -2.654275 1.08172 0.261871
C  -3.165045 2.287755 -0.518563
C  -2.244403 3.494876 -0.379581
C  -2.72355 4.761235 -1.091972
C  -2.77413 -1.403517 0.710479
C  -4.880336 -0.045598 0.699318
C  -1.814314 5.936904 -0.751549
C  -2.80725 4.575397 -2.603208
C  -1.499073 -1.73432 0.014249
C  -0.293762 -1.748302 0.593099
C  0.965691 -2.042208 -0.086668
C  0.905094 -2.341433 -1.550804
C  2.085146 -2.007512 0.668549
C  3.464439 -2.248565 0.235608
C  5.698163 -2.294927 1.028981
C  6.424187 -2.055442 2.328713
H  -3.602723 -0.382482 -0.979901
H  -1.626337 0.880806 -0.057197
H  -2.593324 1.329616 1.328675
H  -4.168866 2.565353 -0.181477
H  -3.26342 2.00773 -1.572138
H  -2.119485 3.717862 0.68602
H  -1.24529 3.235507 -0.750755
H  -3.729586 4.995026 -0.722278
H  -3.443701 -2.268326 0.639403
H  -2.59552 -1.229224 1.776152
H  -4.824381 0.161744 1.771108
H  -5.446632 0.763961 0.237209
H  -5.463555 -0.959667 0.570969
H  -0.792562 5.757634 -1.096584
H  -1.770753 6.112305 0.325452
H  -2.15986 6.860665 -1.220239
H  -1.834922 4.295987 -3.018287
H  -3.520835 3.801114 -2.888439
H  -3.120698 5.497255 -3.097614
H  -1.593541 -1.962019 -1.044229
H  -0.221931 -1.515115 1.652111
H  0.461872 -1.500729 -2.088159
H  0.260662 -3.203657 -1.73268
H  1.874413 -2.547048 -1.986965
H  1.974232 -1.771749 1.721033
H  6.043016 -1.599459 0.26019
H  5.877531 -3.309716 0.666136
H  6.279005 -1.037177 2.691098
H  6.103398 -2.750001 3.10575
H  7.493074 -2.202628 2.172671
elementType: O C H
totalener: -816.43086832 hartree
nucrepener: 1375.43379930 hartree
electener: -2191.86466762 hartree
oneelecener: -3836.17106502 hartree
twoeener: 1644.30639739 hartree
cpcmener: -0.01686744 hartree
kineticenergy: 812.44385928 hartree
xcener: -82.309625699756 hartree
chargesum: -0.0000000
charge: -0.286613 -0.485880 0.088678 -0.176234 -0.122608 -0.157930 0.073555 -0.115052 -0.317667 -0.295970 -0.304489 -0.130151 -0.159548 0.023127 -0.264513 -0.167786 0.461020 0.041193 -0.251100 0.038902 0.076923 0.067756 0.064658 0.064732 0.068257 0.065791 0.025957 0.095405 0.079676 0.084759 0.092687 0.091488 0.080262 0.087555 0.089440 0.082458 0.089553 0.090696 0.121166 0.111810 0.104252 0.104615 0.109003 0.113315 0.091993 0.093584 0.087309 0.086642 0.087324
qa: -0.2866 -0.4859 0.0887 -0.1762 -0.1226 -0.1579 0.0736 -0.1151 -0.3177 -0.2960 -0.3045 -0.1302 -0.1595 0.0231 -0.2645 -0.1678 0.4610 0.0412 -0.2511 0.0389 0.0769 0.0678 0.0647 0.0647 0.0683 0.0658 0.0260 0.0954 0.0797 0.0848 0.0927 0.0915 0.0803 0.0876 0.0894 0.0825 0.0896 0.0907 0.1212 0.1118 0.1043 0.1046 0.1090 0.1133 0.0920 0.0936 0.0873 0.0866 0.0873
va: 2.1187 2.0199 3.7692 3.9000 3.8756 3.8850 3.8172 3.9104 3.9454 3.9311 3.9283 3.8740 3.9128 3.6941 3.9197 3.7766 4.1690 3.8500 3.9695 1.0227 1.0094 1.0135 1.0109 1.0096 1.0116 1.0122 1.0183 1.0056 1.0156 1.0012 1.0026 1.0045 1.0033 1.0048 1.0050 1.0029 1.0024 1.0045 1.0057 1.0236 0.9961 0.9961 1.0372 1.0324 0.9970 0.9964 1.0035 1.0035 1.0067
dispcorr: -0.018411677 hartree
energy: -816.449280000437
dipole: -21.42491 20.47434 -0.95057 22.41333 -22.09771 0.31562 -2.57068 3.21496 0.64428
magnitude: 1.19092 au
magnitude: 3.02709 debye
