program: Orca
programVersion: 5.0.2
elementType: O O C C C C C C C C C C C C C C C C C H H H H H H H H H H H H H H H H H H H H H H H H H H H H H H
charge: 0
multiplicity: 1
keywords: wb97x-d3
keywords: def2-TZVPP
keywords: def2/J RIJCOSX
keywords: DEFGRID2
keywords: scfconv7
keywords: smallprint printgap noloewdin
keywords: NOSOSCF
formula: C17H30O2
InChI: InChI=1/C17H30O2/c1-6-19-17(18)13-16(5)12-8-11-15(4)10-7-9-14(2)3/h8,12-15H,6-7,9-11H2,1-5H3
49 atoms
O  4.000104 -0.7931 0.696297
O  3.524464 -2.417817 -0.763091
C  -3.9554 -0.509007 -0.274155
C  -3.187243 0.590474 -1.015507
C  -2.658963 1.73046 -0.15057
C  -1.77972 2.691712 -0.943204
C  -1.149471 3.815292 -0.117711
C  -3.096018 -1.221649 0.784965
C  -5.244534 0.003029 0.357971
C  -0.138575 4.590532 -0.955186
C  -2.194247 4.762662 0.462351
C  -1.834369 -1.777487 0.22065
C  -0.60877 -1.388681 0.588219
C  0.642424 -1.880274 0.016826
C  0.551682 -2.946273 -1.027676
C  1.780678 -1.312321 0.471019
C  3.154716 -1.59722 0.048177
C  5.40431 -0.917008 0.440122
C  6.034006 -2.046672 1.223553
H  -4.23139 -1.259631 -1.024147
H  -3.839533 1.004925 -1.791597
H  -2.347596 0.134619 -1.550746
H  -2.07312 1.331617 0.684107
H  -3.497226 2.270458 0.297918
H  -0.977382 2.113948 -1.416223
H  -2.358715 3.131459 -1.764647
H  -0.608252 3.353628 0.717555
H  -3.689436 -2.041121 1.205469
H  -2.873062 -0.543246 1.612689
H  -5.051134 0.712786 1.164884
H  -5.874801 0.505161 -0.37878
H  -5.828183 -0.816689 0.782027
H  -0.621088 5.078717 -1.806108
H  0.640934 3.93609 -1.351127
H  0.354749 5.368578 -0.368868
H  -2.775852 5.238045 -0.332197
H  -2.895986 4.252744 1.12391
H  -1.725444 5.558111 1.045396
H  -1.955293 -2.52703 -0.556883
H  -0.515175 -0.630446 1.361212
H  0.008184 -3.80955 -0.6394
H  1.518228 -3.284981 -1.379172
H  -0.013435 -2.582145 -1.888249
H  1.690312 -0.543162 1.229838
H  5.824123 0.038939 0.751249
H  5.589417 -1.025334 -0.6300
H  5.861732 -1.93179 2.294237
H  5.662416 -3.023421 0.91535
H  7.112402 -2.036028 1.058967
elementType: O C H
totalener: -816.42835689 hartree
nucrepener: 1428.91045415 hartree
electener: -2245.33881104 hartree
oneelecener: -3943.17396765 hartree
twoeener: 1697.83515661 hartree
cpcmener: -0.01644356 hartree
kineticenergy: 812.44592289 hartree
xcener: -82.312870409957 hartree
chargesum: 0.0000000
charge: -0.293135 -0.486897 0.085201 -0.160545 -0.170656 -0.155102 0.071810 -0.150830 -0.333024 -0.294901 -0.302516 -0.114386 -0.162180 0.016280 -0.263882 -0.180273 0.472442 0.038730 -0.255401 0.055119 0.087600 0.077729 0.065651 0.084695 0.069435 0.068794 0.026388 0.098229 0.083286 0.082887 0.094437 0.095635 0.079600 0.087699 0.089302 0.081360 0.089096 0.091299 0.126267 0.112593 0.104757 0.107545 0.105672 0.113062 0.106216 0.085693 0.086972 0.088567 0.093682
qa: -0.2931 -0.4869 0.0852 -0.1605 -0.1707 -0.1551 0.0718 -0.1508 -0.3330 -0.2949 -0.3025 -0.1144 -0.1622 0.0163 -0.2639 -0.1803 0.4724 0.0387 -0.2554 0.0551 0.0876 0.0777 0.0657 0.0847 0.0694 0.0688 0.0264 0.0982 0.0833 0.0829 0.0944 0.0956 0.0796 0.0877 0.0893 0.0814 0.0891 0.0913 0.1263 0.1126 0.1048 0.1075 0.1057 0.1131 0.1062 0.0857 0.0870 0.0886 0.0937
va: 2.1166 2.0135 3.7833 3.8837 3.8744 3.8745 3.8182 3.9276 3.9530 3.9311 3.9276 3.8472 3.9130 3.6994 3.9173 3.7714 4.1715 3.8549 3.9145 1.0137 1.0082 1.0081 1.0070 1.0020 1.0133 1.0123 1.0179 1.0066 1.0049 0.9968 1.0028 1.0043 1.0035 1.0050 1.0050 1.0031 1.0027 1.0044 1.0017 1.0213 0.9967 1.0369 0.9957 1.0342 0.9954 1.0124 1.0043 1.0140 1.0073
dispcorr: -0.020092666 hartree
energy: -816.448449554315
dipole: -18.31036 17.41978 -0.89058 17.04628 -16.61100 0.43527 -0.57957 1.07375 0.49417
magnitude: 1.10761 au
magnitude: 2.81533 debye
